ACCESSION: MSBNK-Waters-WA002358
RECORD_TITLE: Valsartan; LC-ESI-Q; MS; POS; 45 V
DATE: 2016.01.19 (Created 2007.08.01, modified 2011.05.06)
AUTHORS: Nihon Waters K.K.
LICENSE: CC BY-NC

CH$NAME: Valsartan
CH$COMPOUND_CLASS: N/A
CH$FORMULA: C24H29N5O3
CH$EXACT_MASS: 435.22704
CH$SMILES: CCCCC(=O)N(CC1=CC=C(C=C1)C2=CC=CC=C2C3=NNN=N3)[C@@H](C(C)C)C(=O)O
CH$IUPAC: InChI=1S/C24H29N5O3/c1-4-5-10-21(30)29(22(16(2)3)24(31)32)15-17-11-13-18(14-12-17)19-8-6-7-9-20(19)23-25-27-28-26-23/h6-9,11-14,16,22H,4-5,10,15H2,1-3H3,(H,31,32)(H,25,26,27,28)/t22-/m0/s1
CH$LINK: CAS 137862-53-4
CH$LINK: INCHIKEY ACWBQPMHZXGDFX-QFIPXVFZSA-N

AC$INSTRUMENT: ZQ, Waters
AC$INSTRUMENT_TYPE: LC-ESI-Q
AC$MASS_SPECTROMETRY: MS_TYPE MS
AC$MASS_SPECTROMETRY: ION_MODE POSITIVE
AC$MASS_SPECTROMETRY: IONIZATION ESI
AC$CHROMATOGRAPHY: RETENTION_TIME 16.900 min
AC$CHROMATOGRAPHY: COLUMN_NAME 2.1 mm id - 3. 5{mu}m XTerra C18MS
AC$CHROMATOGRAPHY: COLUMN_TEMPERATURE 35 C
AC$CHROMATOGRAPHY: SAMPLING_CONE 45 V

MS$DATA_PROCESSING: FIND_PEAK ignore rel.int. < 5

PK$SPLASH: splash10-0a4i-0292200000-8ab73b632df6884f0c6c
PK$NUM_PEAK: 57
PK$PEAK: m/z int. rel.int.
  101 12 12
  104 16 16
  105 364 364
  106 12 12
  111 20 20
  119 12 12
  121 110 110
  122 67 67
  129 24 24
  142 55 55
  153 12 12
  178 24 24
  179 16 16
  180 86 86
  181 12 12
  184 12 12
  186 27 27
  190 82 82
  191 20 20
  192 27 27
  194 39 39
  206 20 20
  207 999 999
  208 141 141
  209 24 24
  210 16 16
  233 12 12
  235 909 909
  236 133 133
  242 125 125
  243 20 20
  276 12 12
  291 674 674
  292 133 133
  293 20 20
  300 47 47
  306 384 384
  307 63 63
  328 24 24
  352 74 74
  353 12 12
  362 129 129
  363 24 24
  408 39 39
  409 31 31
  418 67 67
  419 12 12
  425 20 20
  430 20 20
  436 90 90
  437 20 20
  458 349 349
  459 78 78
  474 231 231
  475 55 55
  476 31 31
  480 12 12