ACCESSION: MSBNK-Waters-WA002080
RECORD_TITLE: Desmethylmaprotiline; LC-ESI-Q; MS; POS; 15 V
DATE: 2016.01.19 (Created 2007.08.01, modified 2011.05.06)
AUTHORS: Nihon Waters K.K.
LICENSE: CC BY-NC

CH$NAME: Desmethylmaprotiline
CH$COMPOUND_CLASS: N/A
CH$FORMULA: C19H21N
CH$EXACT_MASS: 263.16740
CH$SMILES: NCCCC(C3)(c21)c(c4)c(ccc4)C(C3)c(cccc2)1
CH$IUPAC: InChI=1S/C19H21N/c20-13-5-11-19-12-10-14(15-6-1-3-8-17(15)19)16-7-2-4-9-18(16)19/h1-4,6-9,14H,5,10-13,20H2
CH$LINK: CAS 5721-37-9
CH$LINK: INCHIKEY IFHUOEQJTQWFGJ-UHFFFAOYSA-N
CH$LINK: COMPTOX DTXSID80205839

AC$INSTRUMENT: ZQ, Waters
AC$INSTRUMENT_TYPE: LC-ESI-Q
AC$MASS_SPECTROMETRY: MS_TYPE MS
AC$MASS_SPECTROMETRY: ION_MODE POSITIVE
AC$MASS_SPECTROMETRY: IONIZATION ESI
AC$CHROMATOGRAPHY: RETENTION_TIME 14.460 min
AC$CHROMATOGRAPHY: COLUMN_NAME 2.1 mm id - 3. 5{mu}m XTerra C18MS
AC$CHROMATOGRAPHY: COLUMN_TEMPERATURE 35 C
AC$CHROMATOGRAPHY: SAMPLING_CONE 15 V

MS$DATA_PROCESSING: FIND_PEAK ignore rel.int. < 5

PK$SPLASH: splash10-03di-0090000000-73062ee94a847f39f325
PK$NUM_PEAK: 3
PK$PEAK: m/z int. rel.int.
  264 999 999
  265 168 168
  266 16 16