ACCESSION: MSBNK-Waters-WA001698
RECORD_TITLE: Dextromethorphan; LC-ESI-Q; MS; POS; 90 V
DATE: 2016.01.19 (Created 2007.08.01, modified 2011.05.06)
AUTHORS: Nihon Waters K.K.
LICENSE: CC BY-NC

CH$NAME: Dextromethorphan
CH$COMPOUND_CLASS: N/A
CH$FORMULA: C18H25NO
CH$EXACT_MASS: 271.19361
CH$SMILES: COc(c4)cc(c(c4)1)C(C3)(C2)C([H])(CCC3)C(N(C)C2)C1
CH$IUPAC: InChI=1S/C18H25NO/c1-19-10-9-18-8-4-3-5-15(18)17(19)11-13-6-7-14(20-2)12-16(13)18/h6-7,12,15,17H,3-5,8-11H2,1-2H3/t15-,17+,18+/m1/s1
CH$LINK: CAS 125-71-3
CH$LINK: INCHIKEY MKXZASYAUGDDCJ-NJAFHUGGSA-N
CH$LINK: COMPTOX DTXSID3022908

AC$INSTRUMENT: ZQ, Waters
AC$INSTRUMENT_TYPE: LC-ESI-Q
AC$MASS_SPECTROMETRY: MS_TYPE MS
AC$MASS_SPECTROMETRY: ION_MODE POSITIVE
AC$MASS_SPECTROMETRY: IONIZATION ESI
AC$CHROMATOGRAPHY: RETENTION_TIME 13.660 min
AC$CHROMATOGRAPHY: COLUMN_NAME 2.1 mm id - 3. 5{mu}m XTerra C18MS
AC$CHROMATOGRAPHY: COLUMN_TEMPERATURE 35 C
AC$CHROMATOGRAPHY: SAMPLING_CONE 90 V

MS$DATA_PROCESSING: FIND_PEAK ignore rel.int. < 5

PK$SPLASH: splash10-00dj-0910000000-7d412238a73ecb504dc2
PK$NUM_PEAK: 64
PK$PEAK: m/z int. rel.int.
  105 27 27
  107 39 39
  115 59 59
  116 16 16
  117 51 51
  119 47 47
  121 294 294
  122 20 20
  127 8 8
  128 110 110
  129 43 43
  130 12 12
  131 20 20
  132 90 90
  133 12 12
  135 86 86
  136 8 8
  141 82 82
  142 20 20
  143 24 24
  144 121 121
  145 71 71
  146 8 8
  147 623 623
  148 55 55
  149 8 8
  153 20 20
  154 16 16
  155 16 16
  156 67 67
  157 27 27
  158 125 125
  159 247 247
  160 31 31
  161 39 39
  165 24 24
  166 27 27
  167 16 16
  168 8 8
  169 20 20
  170 27 27
  171 999 999
  172 157 157
  173 231 231
  174 31 31
  179 8 8
  181 43 43
  182 20 20
  183 31 31
  184 31 31
  185 39 39
  186 8 8
  187 16 16
  197 8 8
  198 274 274
  199 67 67
  200 20 20
  211 12 12
  213 341 341
  214 39 39
  215 145 145
  216 20 20
  272 51 51
  273 8 8