ACCESSION: MSBNK-Waters-WA001534
RECORD_TITLE: Glipizide; LC-ESI-Q; MS; POS; 30 V
DATE: 2016.01.19 (Created 2007.08.01, modified 2011.05.06)
AUTHORS: Nihon Waters K.K.
LICENSE: CC BY-NC

CH$NAME: Glipizide
CH$COMPOUND_CLASS: N/A
CH$FORMULA: C21H27N5O4S
CH$EXACT_MASS: 445.17838
CH$SMILES: Cc(c3)ncc(n3)C(=O)NCCc(c2)ccc(c2)S(=O)(=O)NC(=O)NC(C1)CCCC1
CH$IUPAC: InChI=1S/C21H27N5O4S/c1-15-13-24-19(14-23-15)20(27)22-12-11-16-7-9-18(10-8-16)31(29,30)26-21(28)25-17-5-3-2-4-6-17/h7-10,13-14,17H,2-6,11-12H2,1H3,(H,22,27)(H2,25,26,28)
CH$LINK: CAS 29094-61-9
CH$LINK: INCHIKEY ZJJXGWJIGJFDTL-UHFFFAOYSA-N
CH$LINK: COMPTOX DTXSID0040676

AC$INSTRUMENT: ZQ, Waters
AC$INSTRUMENT_TYPE: LC-ESI-Q
AC$MASS_SPECTROMETRY: MS_TYPE MS
AC$MASS_SPECTROMETRY: ION_MODE POSITIVE
AC$MASS_SPECTROMETRY: IONIZATION ESI
AC$CHROMATOGRAPHY: RETENTION_TIME 15.820 min
AC$CHROMATOGRAPHY: COLUMN_NAME 2.1 mm id - 3. 5{mu}m XTerra C18MS
AC$CHROMATOGRAPHY: COLUMN_TEMPERATURE 35 C
AC$CHROMATOGRAPHY: SAMPLING_CONE 30 V

MS$DATA_PROCESSING: FIND_PEAK ignore rel.int. < 5

PK$SPLASH: splash10-006t-0209800000-7d358d950beeceb978b2
PK$NUM_PEAK: 35
PK$PEAK: m/z int. rel.int.
  100 419 419
  101 20 20
  122 27 27
  143 12 12
  286 12 12
  304 31 31
  321 999 999
  322 172 172
  323 71 71
  324 8 8
  347 262 262
  348 47 47
  349 27 27
  350 8 8
  369 16 16
  385 39 39
  387 8 8
  403 8 8
  444 149 149
  445 16 16
  446 760 760
  447 153 153
  448 59 59
  449 8 8
  452 8 8
  460 12 12
  462 20 20
  463 8 8
  468 157 157
  469 35 35
  470 12 12
  478 8 8
  484 149 149
  485 24 24
  486 24 24