ACCESSION: MSBNK-Waters-WA001533
RECORD_TITLE: Glipizide; LC-ESI-Q; MS; POS; 45 V
DATE: 2016.01.19 (Created 2007.08.01, modified 2011.05.06)
AUTHORS: Nihon Waters K.K.
LICENSE: CC BY-NC

CH$NAME: Glipizide
CH$COMPOUND_CLASS: N/A
CH$FORMULA: C21H27N5O4S
CH$EXACT_MASS: 445.17838
CH$SMILES: Cc(c3)ncc(n3)C(=O)NCCc(c2)ccc(c2)S(=O)(=O)NC(=O)NC(C1)CCCC1
CH$IUPAC: InChI=1S/C21H27N5O4S/c1-15-13-24-19(14-23-15)20(27)22-12-11-16-7-9-18(10-8-16)31(29,30)26-21(28)25-17-5-3-2-4-6-17/h7-10,13-14,17H,2-6,11-12H2,1H3,(H,22,27)(H2,25,26,28)
CH$LINK: CAS 29094-61-9
CH$LINK: INCHIKEY ZJJXGWJIGJFDTL-UHFFFAOYSA-N
CH$LINK: COMPTOX DTXSID0040676

AC$INSTRUMENT: ZQ, Waters
AC$INSTRUMENT_TYPE: LC-ESI-Q
AC$MASS_SPECTROMETRY: MS_TYPE MS
AC$MASS_SPECTROMETRY: ION_MODE POSITIVE
AC$MASS_SPECTROMETRY: IONIZATION ESI
AC$CHROMATOGRAPHY: RETENTION_TIME 15.820 min
AC$CHROMATOGRAPHY: COLUMN_NAME 2.1 mm id - 3. 5{mu}m XTerra C18MS
AC$CHROMATOGRAPHY: COLUMN_TEMPERATURE 35 C
AC$CHROMATOGRAPHY: SAMPLING_CONE 45 V

MS$DATA_PROCESSING: FIND_PEAK ignore rel.int. < 5

PK$SPLASH: splash10-0fk9-0319400000-3ae6b7ca362fb1a962b0
PK$NUM_PEAK: 61
PK$PEAK: m/z int. rel.int.
  100 392 392
  101 24 24
  103 16 16
  104 8 8
  120 43 43
  121 20 20
  122 59 59
  123 12 12
  131 12 12
  138 8 8
  148 8 8
  150 27 27
  153 8 8
  166 8 8
  167 215 215
  168 16 16
  169 12 12
  179 8 8
  184 12 12
  203 8 8
  240 12 12
  246 8 8
  256 31 31
  286 243 243
  287 31 31
  288 16 16
  304 290 290
  305 47 47
  306 16 16
  321 999 999
  322 161 161
  323 63 63
  324 8 8
  343 12 12
  345 8 8
  347 251 251
  348 43 43
  349 31 31
  369 59 59
  370 8 8
  385 71 71
  386 12 12
  387 8 8
  401 20 20
  427 8 8
  429 12 12
  444 78 78
  445 12 12
  446 274 274
  447 55 55
  448 20 20
  452 16 16
  460 8 8
  462 12 12
  468 200 200
  469 39 39
  470 16 16
  484 133 133
  485 27 27
  486 20 20
  500 8 8