ACCESSION: MSBNK-Univ_Toyama-TY000200
RECORD_TITLE: Sennoside A; LC-ESI-ITTOF; MS; [M+NH3+H]+
DATE: 2016.01.19 (Created 2010.10.14, modified 2011.05.06)
AUTHORS: Ken TANAKA
LICENSE: CC BY-SA

CH$NAME: Sennoside A
CH$NAME: (9R,9'R)-5,5'-Bis(beta-D-glucopyranosyloxy)-9,9',10,10'-tetrahydro-4,4'-dihydroxy-10,10'-dioxo- [9,9'-bianthracene]-2,2'-dicarboxylic acid
CH$NAME: (R*,R*)-5,5'-Bis(beta-D-glucopyranosyloxy)-9,9',10,10'-tetrahydro-4,4'-dihydroxy-10,10'-dioxo-[9,9'-bianthracene]-2,2'-dicarboxylic acid
CH$NAME: Gentle Nature
CH$NAME: Glysennid
CH$COMPOUND_CLASS: Natural Product; Anthraquinone
CH$FORMULA: C42H38O20
CH$EXACT_MASS: 862.19564
CH$SMILES: OC(=O)c(c8)cc(c(c38)C(c(c(C([H])(C([H])(c67)c(c(C(c(c(cc(c7)C(O)=O)O)6)=O)4)cccc4OC(C(O)5)OC(CO)C(C5O)O)3)2)c(ccc2)OC(C(O)1)OC(CO)C(C1O)O)=O)O
CH$IUPAC: InChI=1S/C42H38O20/c43-11-23-31(47)35(51)37(53)41(61-23)59-21-5-1-3-15-25(17-7-13(39(55)56)9-19(45)27(17)33(49)29(15)21)26-16-4-2-6-22(60-42-38(54)36(52)32(48)24(12-44)62-42)30(16)34(50)28-18(26)8-14(40(57)58)10-20(28)46/h1-10,23-26,31-32,35-38,41-48,51-54H,11-12H2,(H,55,56)(H,57,58)/t23-,24-,25-,26-,31-,32-,35+,36+,37-,38-,41-,42-/m1/s1
CH$LINK: CAS 81-27-6
CH$LINK: INCHIKEY IPQVTOJGNYVQEO-KGFNBKMBSA-N
CH$LINK: COMPTOX DTXSID1023576

AC$INSTRUMENT: LCMS-IT-TOF
AC$INSTRUMENT_TYPE: LC-ESI-ITTOF
AC$MASS_SPECTROMETRY: MS_TYPE MS
AC$MASS_SPECTROMETRY: ION_MODE POSITIVE
AC$MASS_SPECTROMETRY: CDL_TEMPERATURE 200 C
AC$MASS_SPECTROMETRY: INTERFACE_VOLTAGE +4.50 kV
AC$MASS_SPECTROMETRY: SCANNING 0.1 sec/scan (m/z = 200-2000)
AC$CHROMATOGRAPHY: COLUMN_NAME Waters Atlantis T3 (2.1 x 150 mm, 5 um)
AC$CHROMATOGRAPHY: COLUMN_TEMPERATURE 40 C
AC$CHROMATOGRAPHY: FLOW_GRADIENT 10 % B to 100 % B/40 min
AC$CHROMATOGRAPHY: FLOW_RATE 0.2 ml/min
AC$CHROMATOGRAPHY: RETENTION_TIME 3.693333 min
AC$CHROMATOGRAPHY: SOLVENT A 5 mM ammonium acetate
AC$CHROMATOGRAPHY: SOLVENT B CH3CN

MS$FOCUSED_ION: BASE_PEAK 270.056500

PK$SPLASH: splash10-0080-0041020091-4bea79139b8122715b93
PK$NUM_PEAK: 126
PK$PEAK: m/z int. rel.int.
  200.118300 3367.000000 13
  208.330000 3367.000000 13
  211.183100 3367.000000 13
  215.153600 3367.000000 13
  221.743600 3367.000000 13
  222.531300 3367.000000 13
  223.349200 3367.000000 13
  224.039100 3367.000000 13
  236.402300 3367.000000 13
  262.125000 3367.000000 13
  266.201400 3367.000000 13
  266.624900 3367.000000 13
  269.031000 6449.000000 26
  270.056500 252021.000000 999
  270.293400 6449.000000 26
  270.546300 6163.000000 24
  271.052300 22652.000000 90
  277.177600 6449.000000 26
  283.241900 3367.000000 13
  290.222500 3367.000000 13
  291.796200 3367.000000 13
  306.235300 4451.000000 18
  313.321900 3367.000000 13
  328.190800 3367.000000 13
  336.335800 6163.000000 24
  349.108500 3367.000000 13
  378.334100 3367.000000 13
  384.904400 3367.000000 13
  385.451400 3367.000000 13
  391.265100 3367.000000 13
  392.292200 3367.000000 13
  393.092000 3367.000000 13
  395.840400 3367.000000 13
  399.154900 3367.000000 13
  401.192600 6449.000000 26
  418.899400 3367.000000 13
  429.567500 3367.000000 13
  434.681400 3367.000000 13
  442.510000 3367.000000 13
  450.204500 3367.000000 13
  451.122500 3367.000000 13
  460.622100 3367.000000 13
  475.507500 3367.000000 13
  521.364400 3367.000000 13
  527.769100 3367.000000 13
  538.129200 3367.000000 13
  539.088200 139131.000000 552
  539.735500 3367.000000 13
  540.092700 26181.000000 104
  541.098200 3367.000000 13
  556.088000 6449.000000 26
  620.415300 3367.000000 13
  624.250900 3367.000000 13
  634.860000 3367.000000 13
  637.963000 3367.000000 13
  664.049900 3367.000000 13
  672.795300 3367.000000 13
  685.668200 3367.000000 13
  692.378000 3367.000000 13
  701.154600 11057.000000 44
  723.493200 3367.000000 13
  774.614400 5307.000000 21
  797.243700 3367.000000 13
  839.242800 3367.000000 13
  855.663800 3367.000000 13
  865.813400 3367.000000 13
  866.350700 3367.000000 13
  880.237300 215401.000000 854
  880.807600 3367.000000 13
  881.235400 115168.000000 457
  881.577800 3367.000000 13
  882.205600 32574.000000 129
  882.690900 8116.000000 32
  883.233500 11198.000000 44
  885.176600 151546.000000 601
  886.177500 78215.000000 310
  886.749800 3367.000000 13
  887.207700 14424.000000 57
  888.209800 3367.000000 13
  893.659600 3367.000000 13
  894.176800 3367.000000 13
  901.144400 27849.000000 110
  901.606000 3367.000000 13
  902.125500 15806.000000 63
  903.164800 3367.000000 13
  904.147000 3367.000000 13
  904.667200 3367.000000 13
  905.621300 3367.000000 13
  906.315500 3367.000000 13
  914.346800 3367.000000 13
  971.109200 3367.000000 13
  990.460400 3367.000000 13
  1092.016200 3367.000000 13
  1116.958600 3367.000000 13
  1117.569000 3367.000000 13
  1203.356200 3367.000000 13
  1285.622100 3367.000000 13
  1303.601900 3367.000000 13
  1311.803200 6163.000000 24
  1312.360100 6163.000000 24
  1312.847600 3367.000000 13
  1313.787800 3367.000000 13
  1314.310400 9531.000000 38
  1314.833000 3367.000000 13
  1316.262100 6449.000000 26
  1332.313600 3367.000000 13
  1372.209200 3367.000000 13
  1402.274200 3367.000000 13
  1457.982700 3367.000000 13
  1496.504900 3367.000000 13
  1602.288400 3367.000000 13
  1618.021000 3367.000000 13
  1637.250400 3367.000000 13
  1725.268400 3367.000000 13
  1745.083000 5307.000000 21
  1746.729300 3367.000000 13
  1747.894200 3367.000000 13
  1758.798800 6449.000000 26
  1772.406600 6449.000000 26
  1773.539500 3367.000000 13
  1782.170100 3367.000000 13
  1817.188400 3367.000000 13
  1879.988300 3367.000000 13
  1882.322400 3367.000000 13
  1913.007100 6449.000000 26
  1978.923700 3367.000000 13