ACCESSION: MSBNK-RIKEN-PR010046
RECORD_TITLE: D-(+)-Mannose; GC-EI-TOF; MS; 5 TMS; 1 MEOX; BP:73
DATE: 2016.01.19 (Created 2006.12.21, modified 2011.05.06)
AUTHORS: Kusano M, Fukushima A, Plant Science Center, RIKEN.
LICENSE: CC BY-SA

CH$NAME: D-(+)-Mannose
CH$NAME: D-Mannose
CH$NAME: Seminose
CH$NAME: Mannose
CH$NAME: Carubinose
CH$COMPOUND_CLASS: Natural Product
CH$FORMULA: C6H12O6
CH$EXACT_MASS: 180.06339
CH$SMILES: OCC(O1)C(O)C(O)C(O)C(O)1
CH$IUPAC: InChI=1S/C6H12O6/c7-1-2-3(8)4(9)5(10)6(11)12-2/h2-11H,1H2/t2-,3-,4+,5+,6?/m1/s1
CH$LINK: CAS 3458-28-4
CH$LINK: CHEBI 16024
CH$LINK: KEGG C00159
CH$LINK: PUBCHEM 3459
CH$LINK: INCHIKEY WQZGKKKJIJFFOK-QTVWNMPRSA-N
CH$LINK: COMPTOX DTXSID5040463

AC$INSTRUMENT: Pegasus III TOF-MS system, Leco; GC 6890, Agilent Technologies
AC$INSTRUMENT_TYPE: GC-EI-TOF
AC$MASS_SPECTROMETRY: MS_TYPE MS
AC$MASS_SPECTROMETRY: ION_MODE POSITIVE
AC$CHROMATOGRAPHY: RETENTION_INDEX 1869.2
AC$CHROMATOGRAPHY: RETENTION_TIME 456.79 sec

MS$FOCUSED_ION: BASE_PEAK 73
MS$FOCUSED_ION: DERIVATIVE_FORM C22H55NO6Si5
MS$FOCUSED_ION: DERIVATIVE_MASS 569.28757
MS$FOCUSED_ION: DERIVATIVE_TYPE 5 TMS; 1 MEOX
MS$DATA_PROCESSING: WHOLE ChromaTOF ver. 2.32 (Leco)

PK$SPLASH: splash10-00di-9831000000-409527d22fb759cb628f
PK$NUM_PEAK: 148
PK$PEAK: m/z int. rel.int.
  60 5 5
  61 6 6
  66 5 5
  67 4 4
  69 1 1
  70 4 4
  71 3 3
  72 17 17
  73 999 999
  74 87 87
  75 56 56
  76 4 4
  77 4 4
  81 1 1
  82 6 6
  83 15 15
  84 3 3
  85 3 3
  86 5 5
  87 5 5
  88 4 4
  89 58 58
  90 5 5
  91 2 2
  97 2 2
  98 1 1
  99 4 4
  100 13 13
  101 16 16
  102 10 10
  103 118 118
  104 12 12
  105 27 27
  106 2 2
  107 1 1
  110 1 1
  111 1 1
  112 2 2
  113 4 4
  114 11 11
  115 7 7
  116 6 6
  117 82 82
  118 8 8
  119 8 8
  120 1 1
  126 1 1
  127 3 3
  128 4 4
  129 101 101
  130 18 18
  131 24 24
  132 4 4
  133 54 54
  134 7 7
  135 4 4
  141 1 1
  142 4 4
  143 11 11
  144 2 2
  145 6 6
  146 1 1
  147 255 255
  148 39 39
  149 24 24
  150 2 2
  151 1 1
  156 1 1
  157 71 71
  158 12 12
  159 5 5
  160 118 118
  161 21 21
  162 6 6
  163 7 7
  164 1 1
  168 1 1
  169 1 1
  170 1 1
  172 2 2
  173 3 3
  174 1 1
  175 3 3
  176 1 1
  177 3 3
  186 2 2
  187 1 1
  189 18 18
  190 5 5
  191 11 11
  192 2 2
  193 1 1
  200 1 1
  201 5 5
  202 2 2
  203 3 3
  204 20 20
  205 170 170
  206 33 33
  207 17 17
  208 2 2
  210 2 2
  215 2 2
  216 6 6
  217 71 71
  218 15 15
  219 7 7
  220 1 1
  221 4 4
  222 1 1
  228 1 1
  229 21 21
  230 6 6
  231 8 8
  232 3 3
  233 5 5
  234 3 3
  235 1 1
  243 1 1
  244 2 2
  245 1 1
  246 2 2
  247 1 1
  256 1 1
  260 1 1
  262 2 2
  269 1 1
  270 1 1
  274 3 3
  275 1 1
  277 4 4
  278 1 1
  291 6 6
  292 2 2
  293 1 1
  300 1 1
  305 3 3
  306 1 1
  307 3 3
  308 1 1
  318 2 2
  319 132 132
  320 40 40
  321 20 20
  322 4 4
  323 1 1
  364 2 2
  365 1 1