ACCESSION: MSBNK-Waters-WA002807
RECORD_TITLE: Desethylamiodarone; LC-ESI-Q; MS; POS; 60 V
DATE: 2016.01.19 (Created 2007.08.01, modified 2011.05.06)
AUTHORS: Nihon Waters K.K.
LICENSE: CC BY-NC

CH$NAME: Desethylamiodarone
CH$COMPOUND_CLASS: N/A
CH$FORMULA: C23H25I2NO3
CH$EXACT_MASS: 616.99238
CH$SMILES: CCNCCOc(c(I)3)c(I)cc(c3)C(=O)c(c(CCCC)1)c(c2)c(ccc2)o1
CH$IUPAC: InChI=1S/C23H25I2NO3/c1-3-5-9-20-21(16-8-6-7-10-19(16)29-20)22(27)15-13-17(24)23(18(25)14-15)28-12-11-26-4-2/h6-8,10,13-14,26H,3-5,9,11-12H2,1-2H3
CH$LINK: CAS 83409-32-9
CH$LINK: INCHIKEY VXOKDLACQICQFA-UHFFFAOYSA-N
CH$LINK: COMPTOX DTXSID00232344

AC$INSTRUMENT: ZQ, Waters
AC$INSTRUMENT_TYPE: LC-ESI-Q
AC$MASS_SPECTROMETRY: MS_TYPE MS
AC$MASS_SPECTROMETRY: ION_MODE POSITIVE
AC$MASS_SPECTROMETRY: IONIZATION ESI
AC$CHROMATOGRAPHY: RETENTION_TIME 16.100 min
AC$CHROMATOGRAPHY: COLUMN_NAME 2.1 mm id - 3. 5{mu}m XTerra C18MS
AC$CHROMATOGRAPHY: COLUMN_TEMPERATURE 35 C
AC$CHROMATOGRAPHY: SAMPLING_CONE 60 V

MS$DATA_PROCESSING: FIND_PEAK ignore rel.int. < 5

PK$SPLASH: splash10-0002-0032293000-eb7a746b421127e8030d
PK$NUM_PEAK: 26
PK$PEAK: m/z int. rel.int.
  121 20 20
  159 20 20
  201 255 255
  202 27 27
  247 125 125
  268 43 43
  269 8 8
  276 8 8
  277 8 8
  279 8 8
  295 12 12
  364 16 16
  373 262 262
  374 12 12
  405 8 8
  421 180 180
  422 27 27
  434 8 8
  492 43 43
  493 8 8
  547 999 999
  548 137 137
  549 12 12
  618 400 400
  619 67 67
  620 8 8