ACCESSION: MSBNK-Waters-WA002779
RECORD_TITLE: Coumatetralyl; LC-ESI-Q; MS; POS; 75 V
DATE: 2016.01.19 (Created 2007.08.01, modified 2011.05.06)
AUTHORS: Nihon Waters K.K.
LICENSE: CC BY-NC

CH$NAME: Coumatetralyl
CH$COMPOUND_CLASS: N/A
CH$FORMULA: C19H16O3
CH$EXACT_MASS: 292.10994
CH$SMILES: c(c4)cc(C3)c(c4)C(CC3)C(C(=O)1)=C(O)c(c2)c(ccc2)O1
CH$IUPAC: InChI=1S/C19H16O3/c20-18-15-9-3-4-11-16(15)22-19(21)17(18)14-10-5-7-12-6-1-2-8-13(12)14/h1-4,6,8-9,11,14,20H,5,7,10H2
CH$LINK: CAS 5836-29-3
CH$LINK: INCHIKEY ULSLJYXHZDTLQK-UHFFFAOYSA-N
CH$LINK: COMPTOX DTXSID8041799

AC$INSTRUMENT: ZQ, Waters
AC$INSTRUMENT_TYPE: LC-ESI-Q
AC$MASS_SPECTROMETRY: MS_TYPE MS
AC$MASS_SPECTROMETRY: ION_MODE POSITIVE
AC$MASS_SPECTROMETRY: IONIZATION ESI
AC$CHROMATOGRAPHY: RETENTION_TIME 18.600 min
AC$CHROMATOGRAPHY: COLUMN_NAME 2.1 mm id - 3. 5{mu}m XTerra C18MS
AC$CHROMATOGRAPHY: COLUMN_TEMPERATURE 35 C
AC$CHROMATOGRAPHY: SAMPLING_CONE 75 V

MS$DATA_PROCESSING: FIND_PEAK ignore rel.int. < 5

PK$SPLASH: splash10-0a4i-0900000000-0c75034a078fd1782fe5
PK$NUM_PEAK: 33
PK$PEAK: m/z int. rel.int.
  103 78 78
  105 98 98
  106 8 8
  107 999 999
  108 74 74
  109 8 8
  115 31 31
  116 43 43
  117 16 16
  118 121 121
  119 20 20
  121 458 458
  122 39 39
  127 8 8
  128 63 63
  129 43 43
  131 94 94
  132 27 27
  134 12 12
  144 12 12
  147 12 12
  148 8 8
  153 8 8
  159 8 8
  163 35 35
  164 16 16
  166 12 12
  175 325 325
  176 35 35
  184 12 12
  189 16 16
  216 16 16
  293 8 8