ACCESSION: MSBNK-Waters-WA002608
RECORD_TITLE: Dihydralazine; LC-ESI-Q; MS; POS; 60 V
DATE: 2016.01.19 (Created 2007.08.01, modified 2011.05.06)
AUTHORS: Nihon Waters K.K.
LICENSE: CC BY-NC

CH$NAME: Dihydralazine
CH$COMPOUND_CLASS: N/A
CH$FORMULA: C8H10N6
CH$EXACT_MASS: 190.09669
CH$SMILES: NNc(n1)c(c2)c(ccc2)c(NN)n1
CH$IUPAC: InChI=1S/C8H10N6/c9-11-7-5-3-1-2-4-6(5)8(12-10)14-13-7/h1-4H,9-10H2,(H,11,13)(H,12,14)
CH$LINK: CAS 484-23-1
CH$LINK: INCHIKEY VQKLRVZQQYVIJW-UHFFFAOYSA-N
CH$LINK: COMPTOX DTXSID0022935

AC$INSTRUMENT: ZQ, Waters
AC$INSTRUMENT_TYPE: LC-ESI-Q
AC$MASS_SPECTROMETRY: MS_TYPE MS
AC$MASS_SPECTROMETRY: ION_MODE POSITIVE
AC$MASS_SPECTROMETRY: IONIZATION ESI
AC$CHROMATOGRAPHY: RETENTION_TIME 2.370 min
AC$CHROMATOGRAPHY: COLUMN_NAME 2.1 mm id - 3. 5{mu}m XTerra C18MS
AC$CHROMATOGRAPHY: COLUMN_TEMPERATURE 35 C
AC$CHROMATOGRAPHY: SAMPLING_CONE 60 V

MS$DATA_PROCESSING: FIND_PEAK ignore rel.int. < 5

PK$SPLASH: splash10-0ufr-1900000000-67561688c31098139b1c
PK$NUM_PEAK: 23
PK$PEAK: m/z int. rel.int.
  76 129 129
  85 27 27
  89 55 55
  90 43 43
  91 39 39
  92 90 90
  95 39 39
  97 16 16
  102 999 999
  103 286 286
  104 24 24
  117 43 43
  118 20 20
  120 372 372
  121 35 35
  129 838 838
  130 525 525
  131 47 47
  145 20 20
  146 16 16
  147 24 24
  149 20 20
  165 12 12