ACCESSION: MSBNK-Waters-WA002606
RECORD_TITLE: Dihydralazine; LC-ESI-Q; MS; POS; 90 V
DATE: 2016.01.19 (Created 2007.08.01, modified 2011.05.06)
AUTHORS: Nihon Waters K.K.
LICENSE: CC BY-NC

CH$NAME: Dihydralazine
CH$COMPOUND_CLASS: N/A
CH$FORMULA: C8H10N6
CH$EXACT_MASS: 190.09669
CH$SMILES: NNc(n1)c(c2)c(ccc2)c(NN)n1
CH$IUPAC: InChI=1S/C8H10N6/c9-11-7-5-3-1-2-4-6(5)8(12-10)14-13-7/h1-4H,9-10H2,(H,11,13)(H,12,14)
CH$LINK: CAS 484-23-1
CH$LINK: INCHIKEY VQKLRVZQQYVIJW-UHFFFAOYSA-N
CH$LINK: COMPTOX DTXSID0022935

AC$INSTRUMENT: ZQ, Waters
AC$INSTRUMENT_TYPE: LC-ESI-Q
AC$MASS_SPECTROMETRY: MS_TYPE MS
AC$MASS_SPECTROMETRY: ION_MODE POSITIVE
AC$MASS_SPECTROMETRY: IONIZATION ESI
AC$CHROMATOGRAPHY: RETENTION_TIME 2.370 min
AC$CHROMATOGRAPHY: COLUMN_NAME 2.1 mm id - 3. 5{mu}m XTerra C18MS
AC$CHROMATOGRAPHY: COLUMN_TEMPERATURE 35 C
AC$CHROMATOGRAPHY: SAMPLING_CONE 90 V

MS$DATA_PROCESSING: FIND_PEAK ignore rel.int. < 5

PK$SPLASH: splash10-004i-9100000000-2d96314012361bbf95cb
PK$NUM_PEAK: 19
PK$PEAK: m/z int. rel.int.
  75 999 999
  76 823 823
  77 71 71
  89 43 43
  90 27 27
  92 24 24
  93 20 20
  95 24 24
  99 12 12
  102 192 192
  103 55 55
  107 12 12
  115 12 12
  117 12 12
  119 12 12
  120 31 31
  129 27 27
  130 55 55
  131 16 16