ACCESSION: MSBNK-Waters-WA002512
RECORD_TITLE: Digitoxigenine; LC-ESI-Q; MS; POS; 60 V
DATE: 2016.01.19 (Created 2007.08.01, modified 2011.05.06)
AUTHORS: Nihon Waters K.K.
LICENSE: CC BY-NC

CH$NAME: Digitoxigenine
CH$COMPOUND_CLASS: N/A
CH$FORMULA: C23H34O4
CH$EXACT_MASS: 374.24571
CH$SMILES: O=C(O5)C=C(C5)C(C4)C(C)(C3)C(O)(C4)C([H])(C1)C([H])(C3)C(C)(C2)C([H])(CC(O)C2)C1
CH$IUPAC: InChI=1S/C23H34O4/c1-21-8-5-16(24)12-15(21)3-4-19-18(21)6-9-22(2)17(7-10-23(19,22)26)14-11-20(25)27-13-14/h11,15-19,24,26H,3-10,12-13H2,1-2H3/t15-,16+,17-,18+,19-,21+,22-,23+/m1/s1
CH$LINK: CAS 143-62-4
CH$LINK: INCHIKEY XZTUSOXSLKTKJQ-CESUGQOBSA-N
CH$LINK: COMPTOX DTXSID80162276

AC$INSTRUMENT: ZQ, Waters
AC$INSTRUMENT_TYPE: LC-ESI-Q
AC$MASS_SPECTROMETRY: MS_TYPE MS
AC$MASS_SPECTROMETRY: ION_MODE POSITIVE
AC$MASS_SPECTROMETRY: IONIZATION ESI
AC$CHROMATOGRAPHY: RETENTION_TIME 15.950 min
AC$CHROMATOGRAPHY: COLUMN_NAME 2.1 mm id - 3. 5{mu}m XTerra C18MS
AC$CHROMATOGRAPHY: COLUMN_TEMPERATURE 35 C
AC$CHROMATOGRAPHY: SAMPLING_CONE 60 V

MS$DATA_PROCESSING: FIND_PEAK ignore rel.int. < 5

PK$SPLASH: splash10-0a4r-0931000000-2b0c6c96fc2a5dc83eb2
PK$NUM_PEAK: 160
PK$PEAK: m/z int. rel.int.
  105 580 580
  106 31 31
  107 811 811
  108 67 67
  109 521 521
  110 39 39
  111 106 106
  113 12 12
  117 106 106
  119 333 333
  120 24 24
  121 623 623
  122 63 63
  123 133 133
  125 192 192
  129 51 51
  131 329 329
  132 35 35
  133 388 388
  134 24 24
  135 999 999
  136 98 98
  137 63 63
  139 67 67
  141 20 20
  143 145 145
  144 12 12
  145 411 411
  146 51 51
  147 353 353
  148 51 51
  149 302 302
  150 31 31
  151 59 59
  153 114 114
  154 12 12
  155 102 102
  156 12 12
  157 153 153
  158 27 27
  159 384 384
  160 47 47
  161 423 423
  162 47 47
  163 153 153
  164 12 12
  165 39 39
  167 20 20
  169 82 82
  171 172 172
  172 20 20
  173 153 153
  174 20 20
  175 153 153
  176 35 35
  177 106 106
  178 12 12
  179 16 16
  181 35 35
  182 16 16
  183 153 153
  184 31 31
  185 294 294
  186 35 35
  187 302 302
  188 43 43
  189 157 157
  190 20 20
  191 63 63
  193 27 27
  195 31 31
  197 129 129
  198 27 27
  199 172 172
  200 27 27
  201 176 176
  202 24 24
  203 110 110
  204 20 20
  205 141 141
  206 24 24
  207 27 27
  209 51 51
  210 12 12
  211 176 176
  212 24 24
  213 165 165
  214 39 39
  215 137 137
  216 27 27
  217 118 118
  218 16 16
  219 47 47
  221 31 31
  223 59 59
  224 12 12
  225 86 86
  226 24 24
  227 94 94
  228 16 16
  229 133 133
  230 27 27
  231 180 180
  232 31 31
  233 24 24
  235 20 20
  237 59 59
  238 20 20
  239 94 94
  240 27 27
  241 24 24
  243 129 129
  244 20 20
  245 67 67
  247 16 16
  251 59 59
  252 16 16
  253 55 55
  254 16 16
  255 43 43
  257 196 196
  258 39 39
  259 24 24
  261 16 16
  265 39 39
  267 16 16
  269 31 31
  271 43 43
  273 16 16
  275 12 12
  277 39 39
  278 12 12
  279 184 184
  280 39 39
  281 12 12
  283 90 90
  284 20 20
  285 12 12
  293 321 321
  294 86 86
  295 39 39
  297 35 35
  303 55 55
  311 55 55
  312 16 16
  313 12 12
  321 278 278
  322 55 55
  339 870 870
  340 219 219
  341 24 24
  357 176 176
  358 55 55
  375 196 196
  376 47 47
  377 12 12
  392 47 47
  393 12 12
  397 176 176
  398 47 47