ACCESSION: MSBNK-Waters-WA002302
RECORD_TITLE: Cyclothiazide; LC-ESI-Q; MS; NEG; 90 V
DATE: 2016.01.19 (Created 2007.08.01, modified 2011.05.06)
AUTHORS: Nihon Waters K.K.
LICENSE: CC BY-NC

CH$NAME: Cyclothiazide
CH$COMPOUND_CLASS: N/A
CH$FORMULA: C14H16ClN3O4S2
CH$EXACT_MASS: 389.02708
CH$SMILES: Clc(c4)c(cc(c43)S(=O)(=O)NC(N3)C(C1)C(C=2)CC(C2)1)S(N)(=O)=O
CH$IUPAC: InChI=1S/C14H16ClN3O4S2/c15-10-5-11-13(6-12(10)23(16,19)20)24(21,22)18-14(17-11)9-4-7-1-2-8(9)3-7/h1-2,5-9,14,17-18H,3-4H2,(H2,16,19,20)
CH$LINK: CAS 2259-96-3
CH$LINK: INCHIKEY BOCUKUHCLICSIY-UHFFFAOYSA-N
CH$LINK: COMPTOX DTXSID3022871

AC$INSTRUMENT: ZQ, Waters
AC$INSTRUMENT_TYPE: LC-ESI-Q
AC$MASS_SPECTROMETRY: MS_TYPE MS
AC$MASS_SPECTROMETRY: ION_MODE NEGATIVE
AC$MASS_SPECTROMETRY: IONIZATION ESI
AC$CHROMATOGRAPHY: RETENTION_TIME 15.520 min
AC$CHROMATOGRAPHY: COLUMN_NAME 2.1 mm id - 3. 5{mu}m XTerra C18MS
AC$CHROMATOGRAPHY: COLUMN_TEMPERATURE 35 C
AC$CHROMATOGRAPHY: SAMPLING_CONE 90 V

MS$DATA_PROCESSING: FIND_PEAK ignore rel.int. < 5

PK$SPLASH: splash10-0a4r-0295000000-eaf64b2e61257c666168
PK$NUM_PEAK: 105
PK$PEAK: m/z int. rel.int.
  105 24 24
  107 8 8
  116 12 12
  117 16 16
  118 8 8
  119 8 8
  121 39 39
  124 8 8
  126 106 106
  127 8 8
  128 39 39
  131 39 39
  132 8 8
  135 8 8
  139 16 16
  140 8 8
  141 47 47
  142 43 43
  143 74 74
  144 8 8
  147 8 8
  150 8 8
  151 12 12
  152 8 8
  153 8 8
  154 12 12
  155 12 12
  156 8 8
  157 20 20
  158 212 212
  159 35 35
  164 8 8
  167 8 8
  168 8 8
  169 27 27
  170 12 12
  171 12 12
  174 8 8
  177 12 12
  179 16 16
  181 12 12
  183 8 8
  189 8 8
  190 35 35
  191 8 8
  192 16 16
  194 16 16
  195 51 51
  196 16 16
  197 8 8
  203 39 39
  204 129 129
  205 819 819
  206 137 137
  207 302 302
  208 31 31
  209 20 20
  215 8 8
  217 12 12
  219 8 8
  220 24 24
  221 12 12
  222 133 133
  223 20 20
  224 12 12
  229 24 24
  230 39 39
  231 78 78
  232 24 24
  233 39 39
  235 8 8
  241 20 20
  242 20 20
  243 35 35
  244 12 12
  245 16 16
  256 8 8
  258 168 168
  259 27 27
  260 71 71
  261 16 16
  269 717 717
  270 63 63
  271 309 309
  272 27 27
  273 31 31
  284 20 20
  286 27 27
  288 8 8
  294 24 24
  295 24 24
  296 16 16
  297 12 12
  322 270 270
  323 31 31
  324 129 129
  325 24 24
  326 16 16
  388 999 999
  389 180 180
  390 435 435
  391 71 71
  392 47 47
  393 8 8
  410 8 8