ACCESSION: MSBNK-Waters-WA001779
RECORD_TITLE: Bromocriptine; LC-ESI-Q; MS; POS; 90 V
DATE: 2016.01.19 (Created 2007.08.01, modified 2011.05.06)
AUTHORS: Nihon Waters K.K.
LICENSE: CC BY-NC

CH$NAME: Bromocriptine
CH$COMPOUND_CLASS: N/A
CH$FORMULA: C32H40BrN5O5
CH$EXACT_MASS: 653.22128
CH$SMILES: CC(C)C[C@H]1C(=O)N2CCC[C@H]2[C@]3(N1C(=O)[C@](O3)(C(C)C)NC(=O)[C@H]4CN([C@@H]5CC6=C(NC7=CC=CC(=C67)C5=C4)Br)C)O
CH$IUPAC: InChI=1S/C32H40BrN5O5/c1-16(2)12-24-29(40)37-11-7-10-25(37)32(42)38(24)30(41)31(43-32,17(3)4)35-28(39)18-13-20-19-8-6-9-22-26(19)21(27(33)34-22)14-23(20)36(5)15-18/h6,8-9,13,16-18,23-25,34,42H,7,10-12,14-15H2,1-5H3,(H,35,39)/t18-,23-,24+,25+,31-,32+/m1/s1
CH$LINK: CAS 25614-03-3
CH$LINK: INCHIKEY OZVBMTJYIDMWIL-AYFBDAFISA-N
CH$LINK: COMPTOX DTXSID1022687

AC$INSTRUMENT: ZQ, Waters
AC$INSTRUMENT_TYPE: LC-ESI-Q
AC$MASS_SPECTROMETRY: MS_TYPE MS
AC$MASS_SPECTROMETRY: ION_MODE POSITIVE
AC$MASS_SPECTROMETRY: IONIZATION ESI
AC$CHROMATOGRAPHY: RETENTION_TIME 15.020 min
AC$CHROMATOGRAPHY: COLUMN_NAME 2.1 mm id - 3. 5{mu}m XTerra C18MS
AC$CHROMATOGRAPHY: COLUMN_TEMPERATURE 35 C
AC$CHROMATOGRAPHY: SAMPLING_CONE 90 V

MS$DATA_PROCESSING: FIND_PEAK ignore rel.int. < 5

PK$SPLASH: splash10-0pb9-0194000000-6e15cba5490d7cb12243
PK$NUM_PEAK: 98
PK$PEAK: m/z int. rel.int.
  115 8 8
  124 8 8
  138 8 8
  152 16 16
  153 24 24
  154 8 8
  167 12 12
  178 16 16
  179 27 27
  180 16 16
  181 90 90
  182 8 8
  183 8 8
  190 16 16
  191 63 63
  192 24 24
  193 31 31
  196 12 12
  206 133 133
  207 999 999
  208 98 98
  209 47 47
  211 94 94
  212 16 16
  219 12 12
  220 20 20
  221 121 121
  222 231 231
  223 55 55
  224 86 86
  225 8 8
  234 12 12
  235 8 8
  236 8 8
  237 8 8
  245 8 8
  246 8 8
  247 12 12
  248 12 12
  249 8 8
  258 67 67
  259 8 8
  260 74 74
  261 12 12
  263 8 8
  266 8 8
  269 12 12
  270 31 31
  271 24 24
  272 39 39
  273 8 8
  274 12 12
  275 59 59
  277 51 51
  284 8 8
  285 8 8
  286 137 137
  287 8 8
  288 114 114
  289 16 16
  291 43 43
  299 90 90
  301 380 380
  303 447 447
  304 43 43
  305 125 125
  306 12 12
  315 12 12
  317 12 12
  327 8 8
  329 16 16
  331 16 16
  337 8 8
  339 16 16
  341 12 12
  346 55 55
  347 8 8
  348 55 55
  349 12 12
  355 43 43
  357 47 47
  383 43 43
  384 12 12
  385 55 55
  386 20 20
  400 8 8
  426 12 12
  428 8 8
  636 16 16
  638 24 24
  654 27 27
  655 8 8
  656 35 35
  692 63 63
  693 8 8
  694 63 63
  695 24 24
  696 8 8