ACCESSION: MSBNK-Waters-WA001681
RECORD_TITLE: Diclofenac; LC-ESI-Q; MS; POS; 15 V
DATE: 2016.01.19 (Created 2007.08.01, modified 2011.05.06)
AUTHORS: Nihon Waters K.K.
LICENSE: CC BY-NC

CH$NAME: Diclofenac sodium salt
CH$NAME: Diclofenac
CH$COMPOUND_CLASS: N/A
CH$FORMULA: C14H11Cl2NO2
CH$EXACT_MASS: 295.01668
CH$SMILES: OC(=O)Cc(c2)c(ccc2)Nc(c(Cl)1)c(Cl)ccc1
CH$IUPAC: InChI=1S/C14H11Cl2NO2/c15-10-5-3-6-11(16)14(10)17-12-7-2-1-4-9(12)8-13(18)19/h1-7,17H,8H2,(H,18,19)
CH$LINK: CAS 15307-79-6
CH$LINK: INCHIKEY DCOPUUMXTXDBNB-UHFFFAOYSA-N
CH$LINK: COMPTOX DTXSID6022923

AC$INSTRUMENT: ZQ, Waters
AC$INSTRUMENT_TYPE: LC-ESI-Q
AC$MASS_SPECTROMETRY: MS_TYPE MS
AC$MASS_SPECTROMETRY: ION_MODE POSITIVE
AC$MASS_SPECTROMETRY: IONIZATION ESI
AC$CHROMATOGRAPHY: RETENTION_TIME 18.310 min
AC$CHROMATOGRAPHY: COLUMN_NAME 2.1 mm id - 3. 5{mu}m XTerra C18MS
AC$CHROMATOGRAPHY: COLUMN_TEMPERATURE 35 C
AC$CHROMATOGRAPHY: SAMPLING_CONE 15 V

MS$DATA_PROCESSING: FIND_PEAK ignore rel.int. < 5

PK$SPLASH: splash10-0002-0091000000-641b5d56b858b58404fa
PK$NUM_PEAK: 30
PK$PEAK: m/z int. rel.int.
  122 24 24
  200 8 8
  239 8 8
  252 12 12
  260 12 12
  278 90 90
  280 67 67
  281 8 8
  283 8 8
  288 71 71
  289 20 20
  290 8 8
  296 999 999
  297 98 98
  298 693 693
  299 82 82
  300 125 125
  301 20 20
  310 20 20
  312 8 8
  313 20 20
  318 12 12
  319 8 8
  320 12 12
  326 20 20
  328 12 12
  334 55 55
  336 55 55
  338 8 8
  343 8 8