ACCESSION: MSBNK-Waters-WA001669
RECORD_TITLE: 8-Chlorotheophylline; LC-ESI-Q; MS; POS; 15 V, 30 V
DATE: 2016.01.19 (Created 2007.08.01, modified 2011.05.06)
AUTHORS: Nihon Waters K.K.
LICENSE: CC BY-NC

CH$NAME: 8-Chlorotheophylline
CH$COMPOUND_CLASS: N/A
CH$FORMULA: C7H7ClN4O2
CH$EXACT_MASS: 214.02575
CH$SMILES: CN1C2=C(C(=O)N(C1=O)C)NC(=N2)Cl
CH$IUPAC: InChI=1S/C7H7ClN4O2/c1-11-4-3(9-6(8)10-4)5(13)12(2)7(11)14/h1-2H3,(H,9,10)
CH$LINK: CAS 85-18-7
CH$LINK: INCHIKEY RYIGNEOBDRVTHA-UHFFFAOYSA-N
CH$LINK: COMPTOX DTXSID5043764

AC$INSTRUMENT: ZQ, Waters
AC$INSTRUMENT_TYPE: LC-ESI-Q
AC$MASS_SPECTROMETRY: MS_TYPE MS
AC$MASS_SPECTROMETRY: ION_MODE POSITIVE
AC$MASS_SPECTROMETRY: IONIZATION ESI
AC$CHROMATOGRAPHY: RETENTION_TIME 11.030 min
AC$CHROMATOGRAPHY: COLUMN_NAME 2.1 mm id - 3. 5{mu}m XTerra C18MS
AC$CHROMATOGRAPHY: COLUMN_TEMPERATURE 35 C
AC$CHROMATOGRAPHY: SAMPLING_CONE 15 V, 30 V

MS$DATA_PROCESSING: FIND_PEAK ignore rel.int. < 5

PK$SPLASH: splash10-014i-0290000000-aaa24254f74d717728ee
PK$NUM_PEAK: 34
PK$PEAK: m/z int. rel.int.
  101 20 20
  102 16 16
  105 12 12
  113 16 16
  116 24 24
  122 71 71
  123 20 20
  125 8 8
  131 8 8
  132 8 8
  136 24 24
  140 20 20
  141 24 24
  143 12 12
  146 8 8
  149 12 12
  151 8 8
  158 35 35
  159 12 12
  171 8 8
  181 8 8
  182 8 8
  195 16 16
  203 8 8
  215 999 999
  216 20 20
  217 415 415
  218 16 16
  219 16 16
  224 8 8
  227 12 12
  230 8 8
  231 20 20
  232 63 63