ACCESSION: MSBNK-Waters-WA001584
RECORD_TITLE: Chlorpropamide; LC-ESI-Q; MS; POS; 30 V
DATE: 2016.01.19 (Created 2007.08.01, modified 2011.05.06)
AUTHORS: Nihon Waters K.K.
LICENSE: CC BY-NC

CH$NAME: Chlorpropamide
CH$COMPOUND_CLASS: N/A
CH$FORMULA: C10H13ClN2O3S
CH$EXACT_MASS: 276.03354
CH$SMILES: CCCNC(=O)NS(=O)(=O)c(c1)ccc(Cl)c1
CH$IUPAC: InChI=1S/C10H13ClN2O3S/c1-2-7-12-10(14)13-17(15,16)9-5-3-8(11)4-6-9/h3-6H,2,7H2,1H3,(H2,12,13,14)
CH$LINK: CAS 94-20-2
CH$LINK: INCHIKEY RKWGIWYCVPQPMF-UHFFFAOYSA-N
CH$LINK: COMPTOX DTXSID9020322

AC$INSTRUMENT: ZQ, Waters
AC$INSTRUMENT_TYPE: LC-ESI-Q
AC$MASS_SPECTROMETRY: MS_TYPE MS
AC$MASS_SPECTROMETRY: ION_MODE POSITIVE
AC$MASS_SPECTROMETRY: IONIZATION ESI
AC$CHROMATOGRAPHY: RETENTION_TIME 15.620 min
AC$CHROMATOGRAPHY: COLUMN_NAME 2.1 mm id - 3. 5{mu}m XTerra C18MS
AC$CHROMATOGRAPHY: COLUMN_TEMPERATURE 35 C
AC$CHROMATOGRAPHY: SAMPLING_CONE 30 V

MS$DATA_PROCESSING: FIND_PEAK ignore rel.int. < 5

PK$SPLASH: splash10-004i-0982000000-047d8111b77e62a6b9c5
PK$NUM_PEAK: 97
PK$PEAK: m/z int. rel.int.
  103 396 396
  104 20 20
  105 8 8
  110 31 31
  111 47 47
  113 71 71
  119 16 16
  122 63 63
  124 12 12
  125 16 16
  126 16 16
  127 27 27
  128 12 12
  129 31 31
  139 8 8
  140 12 12
  147 16 16
  148 8 8
  149 24 24
  152 47 47
  156 16 16
  157 8 8
  159 12 12
  161 20 20
  163 16 16
  168 12 12
  175 384 384
  176 12 12
  177 196 196
  183 24 24
  184 8 8
  192 780 780
  193 16 16
  194 188 188
  195 27 27
  198 27 27
  211 16 16
  214 31 31
  219 51 51
  223 20 20
  225 20 20
  226 12 12
  231 12 12
  233 8 8
  235 8 8
  237 39 39
  238 12 12
  241 12 12
  242 24 24
  248 16 16
  249 12 12
  251 8 8
  253 24 24
  254 8 8
  255 20 20
  260 31 31
  261 24 24
  266 12 12
  267 20 20
  268 24 24
  269 16 16
  271 24 24
  272 12 12
  277 999 999
  278 12 12
  279 427 427
  280 31 31
  281 27 27
  282 20 20
  283 55 55
  284 12 12
  285 20 20
  287 16 16
  289 8 8
  291 12 12
  294 59 59
  296 12 12
  297 16 16
  299 262 262
  300 39 39
  301 121 121
  302 24 24
  303 12 12
  304 20 20
  305 24 24
  307 16 16
  310 16 16
  315 204 204
  316 20 20
  317 55 55
  318 47 47
  321 94 94
  323 82 82
  324 27 27
  325 8 8
  327 8 8
  329 8 8