ACCESSION: MSBNK-Waters-WA001567
RECORD_TITLE: Colchicine; LC-ESI-Q; MS; POS; 90 V
DATE: 2016.01.19 (Created 2007.08.01, modified 2011.05.06)
AUTHORS: Nihon Waters K.K.
LICENSE: CC BY-NC

CH$NAME: Colchicine
CH$COMPOUND_CLASS: N/A
CH$FORMULA: C22H25NO6
CH$EXACT_MASS: 399.16819
CH$SMILES: COC(=C3)C(=O)C=C(C(NC(C)=O)2)C(=C3)c(c(CC2)1)c(OC)c(OC)c(OC)c1
CH$IUPAC: InChI=1S/C22H25NO6/c1-12(24)23-16-8-6-13-10-19(27-3)21(28-4)22(29-5)20(13)14-7-9-18(26-2)17(25)11-15(14)16/h7,9-11,16H,6,8H2,1-5H3,(H,23,24)/t16-/m0/s1
CH$LINK: CAS 64-86-8
CH$LINK: INCHIKEY IAKHMKGGTNLKSZ-INIZCTEOSA-N
CH$LINK: COMPTOX DTXSID5024845

AC$INSTRUMENT: ZQ, Waters
AC$INSTRUMENT_TYPE: LC-ESI-Q
AC$MASS_SPECTROMETRY: MS_TYPE MS
AC$MASS_SPECTROMETRY: ION_MODE POSITIVE
AC$MASS_SPECTROMETRY: IONIZATION ESI
AC$CHROMATOGRAPHY: RETENTION_TIME 13.330 min
AC$CHROMATOGRAPHY: COLUMN_NAME 2.1 mm id - 3. 5{mu}m XTerra C18MS
AC$CHROMATOGRAPHY: COLUMN_TEMPERATURE 35 C
AC$CHROMATOGRAPHY: SAMPLING_CONE 90 V

MS$DATA_PROCESSING: FIND_PEAK ignore rel.int. < 5

PK$SPLASH: splash10-0gb9-0291000000-8e0a52f3d761c3ece5ed
PK$NUM_PEAK: 199
PK$PEAK: m/z int. rel.int.
  110 43 43
  119 63 63
  123 43 43
  130 47 47
  131 47 47
  133 153 153
  137 157 157
  145 82 82
  146 43 43
  147 71 71
  148 94 94
  149 35 35
  150 71 71
  151 63 63
  152 98 98
  153 59 59
  158 47 47
  160 63 63
  161 98 98
  162 35 35
  163 43 43
  165 153 153
  166 78 78
  167 110 110
  168 39 39
  169 55 55
  170 35 35
  171 35 35
  173 43 43
  174 39 39
  175 74 74
  176 200 200
  177 114 114
  178 90 90
  179 157 157
  180 55 55
  181 313 313
  182 98 98
  183 86 86
  184 82 82
  185 43 43
  186 43 43
  188 90 90
  189 71 71
  190 98 98
  191 110 110
  192 102 102
  193 110 110
  194 106 106
  195 247 247
  196 157 157
  197 176 176
  198 82 82
  199 149 149
  200 55 55
  201 71 71
  202 43 43
  203 90 90
  204 78 78
  205 184 184
  206 161 161
  207 306 306
  208 212 212
  209 282 282
  210 149 149
  211 266 266
  212 278 278
  213 137 137
  214 71 71
  215 55 55
  216 27 27
  217 55 55
  218 71 71
  219 129 129
  220 137 137
  221 204 204
  222 184 184
  223 372 372
  224 435 435
  225 376 376
  226 215 215
  227 458 458
  228 125 125
  229 86 86
  230 35 35
  231 47 47
  232 39 39
  233 94 94
  234 157 157
  235 376 376
  236 364 364
  237 407 407
  238 215 215
  239 564 564
  240 439 439
  241 360 360
  242 231 231
  243 125 125
  244 63 63
  245 27 27
  246 31 31
  247 86 86
  248 110 110
  249 188 188
  250 298 298
  251 701 701
  252 650 650
  253 404 404
  254 255 255
  255 548 548
  256 282 282
  257 153 153
  258 82 82
  259 51 51
  260 24 24
  261 31 31
  262 43 43
  263 227 227
  264 208 208
  265 341 341
  266 294 294
  267 999 999
  268 599 599
  269 286 286
  270 270 270
  271 200 200
  272 121 121
  273 51 51
  275 20 20
  276 35 35
  277 90 90
  278 196 196
  279 302 302
  280 309 309
  281 266 266
  282 419 419
  283 541 541
  284 235 235
  285 270 270
  286 157 157
  287 145 145
  288 35 35
  291 20 20
  292 82 82
  293 121 121
  294 200 200
  295 482 482
  296 329 329
  297 176 176
  298 192 192
  299 118 118
  300 278 278
  301 86 86
  302 24 24
  306 27 27
  307 27 27
  308 86 86
  309 125 125
  310 278 278
  311 423 423
  312 133 133
  313 94 94
  314 118 118
  315 43 43
  316 16 16
  320 16 16
  321 16 16
  322 20 20
  323 20 20
  324 90 90
  325 74 74
  326 125 125
  327 43 43
  328 106 106
  329 27 27
  330 16 16
  338 24 24
  339 20 20
  340 39 39
  341 47 47
  342 90 90
  343 27 27
  351 12 12
  352 16 16
  354 12 12
  358 43 43
  379 16 16
  384 16 16
  394 165 165
  395 31 31
  400 168 168
  401 39 39
  406 39 39
  422 595 595
  423 129 129
  424 24 24
  438 188 188
  439 35 35
  440 24 24