ACCESSION: MSBNK-Waters-WA001313
RECORD_TITLE: Clenbuterol; LC-ESI-Q; MS; POS; 15 V
DATE: 2016.01.19 (Created 2007.08.01, modified 2011.05.06)
AUTHORS: Nihon Waters K.K.
LICENSE: CC BY-NC

CH$NAME: Clenbuterol
CH$COMPOUND_CLASS: N/A
CH$FORMULA: C12H18Cl2N2O
CH$EXACT_MASS: 276.07962
CH$SMILES: CC(C)(C)NCC(O)c(c1)cc(Cl)c(N)c(Cl)1
CH$IUPAC: InChI=1S/C12H18Cl2N2O/c1-12(2,3)16-6-10(17)7-4-8(13)11(15)9(14)5-7/h4-5,10,16-17H,6,15H2,1-3H3
CH$LINK: CAS 37148-27-9
CH$LINK: INCHIKEY STJMRWALKKWQGH-UHFFFAOYSA-N
CH$LINK: COMPTOX DTXSID7022833

AC$INSTRUMENT: ZQ, Waters
AC$INSTRUMENT_TYPE: LC-ESI-Q
AC$MASS_SPECTROMETRY: MS_TYPE MS
AC$MASS_SPECTROMETRY: ION_MODE POSITIVE
AC$MASS_SPECTROMETRY: IONIZATION ESI
AC$CHROMATOGRAPHY: RETENTION_TIME 11.900 min
AC$CHROMATOGRAPHY: COLUMN_NAME 2.1 mm id - 3. 5{mu}m XTerra C18MS
AC$CHROMATOGRAPHY: COLUMN_TEMPERATURE 35 C
AC$CHROMATOGRAPHY: SAMPLING_CONE 15 V

MS$DATA_PROCESSING: FIND_PEAK ignore rel.int. < 5

PK$SPLASH: splash10-004i-0090000000-9a313e8c6615d07d10f6
PK$NUM_PEAK: 18
PK$PEAK: m/z int. rel.int.
  203 8 8
  243 8 8
  259 86 86
  260 12 12
  261 71 71
  262 8 8
  263 8 8
  277 999 999
  278 82 82
  279 705 705
  280 55 55
  281 110 110
  282 8 8
  553 8 8
  555 12 12
  589 12 12
  591 20 20
  593 12 12