ACCESSION: MSBNK-Waters-WA001287
RECORD_TITLE: Flunitrazepam; LC-ESI-Q; MS; POS; 75 V
DATE: 2016.01.19 (Created 2007.08.01, modified 2011.05.06)
AUTHORS: Nihon Waters K.K.
LICENSE: CC BY-NC

CH$NAME: Flunitrazepam
CH$COMPOUND_CLASS: N/A
CH$FORMULA: C16H12FN3O3
CH$EXACT_MASS: 313.08627
CH$SMILES: O=N(=O)c(c3)cc(c(c3)2)C(=NCC(=O)N(C)2)c(c1)c(F)ccc1
CH$IUPAC: InChI=1S/C16H12FN3O3/c1-19-14-7-6-10(20(22)23)8-12(14)16(18-9-15(19)21)11-4-2-3-5-13(11)17/h2-8H,9H2,1H3
CH$LINK: CAS 1622-62-4
CH$LINK: INCHIKEY PPTYJKAXVCCBDU-UHFFFAOYSA-N
CH$LINK: COMPTOX DTXSID7023065

AC$INSTRUMENT: ZQ, Waters
AC$INSTRUMENT_TYPE: LC-ESI-Q
AC$MASS_SPECTROMETRY: MS_TYPE MS
AC$MASS_SPECTROMETRY: ION_MODE POSITIVE
AC$MASS_SPECTROMETRY: IONIZATION ESI
AC$CHROMATOGRAPHY: RETENTION_TIME 16.100 min
AC$CHROMATOGRAPHY: COLUMN_NAME 2.1 mm id - 3. 5{mu}m XTerra C18MS
AC$CHROMATOGRAPHY: COLUMN_TEMPERATURE 35 C
AC$CHROMATOGRAPHY: SAMPLING_CONE 75 V

MS$DATA_PROCESSING: FIND_PEAK ignore rel.int. < 5

PK$SPLASH: splash10-02ti-0390000000-f3b5a138634b491b5840
PK$NUM_PEAK: 91
PK$PEAK: m/z int. rel.int.
  104 31 31
  105 8 8
  106 16 16
  107 63 63
  109 59 59
  117 39 39
  118 98 98
  119 278 278
  120 27 27
  122 12 12
  123 51 51
  131 12 12
  132 16 16
  133 12 12
  134 16 16
  143 31 31
  144 24 24
  145 31 31
  146 8 8
  147 90 90
  148 8 8
  150 8 8
  161 8 8
  164 8 8
  165 55 55
  166 16 16
  167 8 8
  170 67 67
  171 12 12
  172 12 12
  173 12 12
  174 12 12
  178 8 8
  179 12 12
  180 12 12
  182 8 8
  183 165 165
  184 43 43
  185 27 27
  186 12 12
  190 24 24
  191 24 24
  192 35 35
  193 35 35
  194 8 8
  196 8 8
  197 133 133
  198 180 180
  199 55 55
  200 16 16
  201 12 12
  204 8 8
  205 121 121
  206 31 31
  208 16 16
  209 16 16
  210 165 165
  211 376 376
  212 255 255
  213 110 110
  214 12 12
  219 98 98
  220 39 39
  221 129 129
  222 125 125
  223 55 55
  224 71 71
  225 121 121
  226 27 27
  227 118 118
  228 39 39
  237 24 24
  238 31 31
  239 936 936
  240 415 415
  241 51 51
  249 8 8
  251 8 8
  253 8 8
  255 16 16
  256 12 12
  257 27 27
  267 27 27
  268 999 999
  269 153 153
  270 27 27
  283 12 12
  284 8 8
  286 24 24
  314 78 78
  315 8 8