ACCESSION: MSBNK-Waters-WA001212
RECORD_TITLE: Acepromethazine; LC-ESI-Q; MS; POS; 15 V
DATE: 2016.01.19 (Created 2007.08.01, modified 2011.05.06)
AUTHORS: Nihon Waters K.K.
LICENSE: CC BY-NC

CH$NAME: Acepromethazine
CH$COMPOUND_CLASS: N/A
CH$FORMULA: C19H22N2OS
CH$EXACT_MASS: 326.14528
CH$SMILES: CN(C)C(C)CN(c21)c(c3)c(ccc(C(C)=O)3)Sc(cccc2)1
CH$IUPAC: InChI=1S/C19H22N2OS/c1-13(20(3)4)12-21-16-7-5-6-8-18(16)23-19-10-9-15(14(2)22)11-17(19)21/h5-11,13H,12H2,1-4H3
CH$LINK: CAS 13461-01-3
CH$LINK: INCHIKEY XLOQNFNTQIRSOX-UHFFFAOYSA-N

AC$INSTRUMENT: ZQ, Waters
AC$INSTRUMENT_TYPE: LC-ESI-Q
AC$MASS_SPECTROMETRY: MS_TYPE MS
AC$MASS_SPECTROMETRY: ION_MODE POSITIVE
AC$MASS_SPECTROMETRY: IONIZATION ESI
AC$CHROMATOGRAPHY: RETENTION_TIME 14.030 min
AC$CHROMATOGRAPHY: COLUMN_NAME 2.1 mm id - 3. 5{mu}m XTerra C18MS
AC$CHROMATOGRAPHY: COLUMN_TEMPERATURE 35 C
AC$CHROMATOGRAPHY: SAMPLING_CONE 15 V

MS$DATA_PROCESSING: FIND_PEAK ignore rel.int. < 5

PK$SPLASH: splash10-004i-0009000000-f7ddc113d26157caa62e
PK$NUM_PEAK: 9
PK$PEAK: m/z int. rel.int.
  327 999 999
  328 196 196
  329 63 63
  330 12 12
  343 118 118
  344 24 24
  345 8 8
  359 63 63
  360 8 8