ACCESSION: MSBNK-Waters-WA001155
RECORD_TITLE: Budesonide; LC-ESI-Q; MS; POS; 15 V
DATE: 2016.01.19 (Created 2007.08.01, modified 2012.10.22)
AUTHORS: Nihon Waters K.K.
LICENSE: CC BY-NC

CH$NAME: Budesonide
CH$COMPOUND_CLASS: N/A
CH$FORMULA: C25H34O6
CH$EXACT_MASS: 430.23554
CH$SMILES: C(C31[H])(O)CC(C4(C(=O)CO)5)(C(CC4OC(CCC)O5)(C1([H])CCC(C3(C)2)=CC(=O)C=C2)[H])C
CH$IUPAC: InChI=1S/C25H34O6/c1-4-5-21-30-20-11-17-16-7-6-14-10-15(27)8-9-23(14,2)22(16)18(28)12-24(17,3)25(20,31-21)19(29)13-26/h8-10,16-18,20-22,26,28H,4-7,11-13H2,1-3H3/t16-,17-,18-,20+,21?,22+,23-,24-,25+/m0/s1
CH$LINK: CAS 51333-22-3
CH$LINK: INCHIKEY VOVIALXJUBGFJZ-KWVAZRHASA-N
CH$LINK: COMPTOX DTXSID8020202

AC$INSTRUMENT: ZQ, Waters
AC$INSTRUMENT_TYPE: LC-ESI-Q
AC$MASS_SPECTROMETRY: MS_TYPE MS
AC$MASS_SPECTROMETRY: ION_MODE POSITIVE
AC$MASS_SPECTROMETRY: IONIZATION ESI
AC$CHROMATOGRAPHY: RETENTION_TIME 17.000 min
AC$CHROMATOGRAPHY: COLUMN_NAME 2.1 mm id - 3. 5{mu}m XTerra C18MS
AC$CHROMATOGRAPHY: COLUMN_TEMPERATURE 35 C
AC$CHROMATOGRAPHY: SAMPLING_CONE 15 V

MS$DATA_PROCESSING: FIND_PEAK ignore rel.int. < 5

PK$SPLASH: splash10-001i-0000900000-c792c12c6ff191413bec
PK$NUM_PEAK: 14
PK$PEAK: m/z int. rel.int.
  225 12 12
  387 35 35
  388 8 8
  404 47 47
  405 8 8
  413 78 78
  414 12 12
  425 8 8
  431 999 999
  432 192 192
  433 27 27
  448 106 106
  449 20 20
  472 27 27