ACCESSION: MSBNK-Waters-WA001138
RECORD_TITLE: Clozapine; LC-ESI-Q; MS; POS; 30 V
DATE: 2016.01.19 (Created 2007.08.01, modified 2011.05.06)
AUTHORS: Nihon Waters K.K.
LICENSE: CC BY-NC

CH$NAME: Clozapine
CH$COMPOUND_CLASS: N/A
CH$FORMULA: C18H19ClN4
CH$EXACT_MASS: 326.12982
CH$SMILES: CN(C4)CCN(C4)C(=N1)c(c3)c(ccc3)Nc(c2)c(cc(Cl)c2)1
CH$IUPAC: InChI=1S/C18H19ClN4/c1-22-8-10-23(11-9-22)18-14-4-2-3-5-15(14)20-16-7-6-13(19)12-17(16)21-18/h2-7,12,20H,8-11H2,1H3
CH$LINK: CAS 5786-21-0
CH$LINK: INCHIKEY QZUDBNBUXVUHMW-UHFFFAOYSA-N
CH$LINK: COMPTOX DTXSID5022855

AC$INSTRUMENT: ZQ, Waters
AC$INSTRUMENT_TYPE: LC-ESI-Q
AC$MASS_SPECTROMETRY: MS_TYPE MS
AC$MASS_SPECTROMETRY: ION_MODE POSITIVE
AC$MASS_SPECTROMETRY: IONIZATION ESI
AC$CHROMATOGRAPHY: RETENTION_TIME 13.800 min
AC$CHROMATOGRAPHY: COLUMN_NAME 2.1 mm id - 3. 5{mu}m XTerra C18MS
AC$CHROMATOGRAPHY: COLUMN_TEMPERATURE 35 C
AC$CHROMATOGRAPHY: SAMPLING_CONE 30 V

MS$DATA_PROCESSING: FIND_PEAK ignore rel.int. < 5

PK$SPLASH: splash10-004i-0019000000-31f6aedd81462a51bd1e
PK$NUM_PEAK: 20
PK$PEAK: m/z int. rel.int.
  100 12 12
  158 55 55
  159 8 8
  228 16 16
  230 8 8
  243 149 149
  244 20 20
  245 27 27
  270 63 63
  271 8 8
  272 20 20
  325 24 24
  326 43 43
  327 999 999
  328 184 184
  329 337 337
  330 55 55
  341 8 8
  343 12 12
  359 8 8