ACCESSION: MSBNK-Waters-WA001129
RECORD_TITLE: Clozapine N-oxide; LC-ESI-Q; MS; POS; 75 V, 90 V
DATE: 2016.01.19 (Created 2007.08.01, modified 2011.05.06)
AUTHORS: Nihon Waters K.K.
LICENSE: CC BY-NC

CH$NAME: Clozapine N-oxide
CH$COMPOUND_CLASS: N/A
CH$FORMULA: C18H19ClN4O
CH$EXACT_MASS: 342.12474
CH$SMILES: Clc(c4)cc(N=1)c(c4)Nc(c3)c(ccc3)C1N(C2)CC[N+1](C)([O-1])C2
CH$IUPAC: InChI=1S/C18H19ClN4O/c1-23(24)10-8-22(9-11-23)18-14-4-2-3-5-15(14)20-16-7-6-13(19)12-17(16)21-18/h2-7,12,20H,8-11H2,1H3
CH$LINK: CAS 34233-69-7
CH$LINK: INCHIKEY OGUCZBIQSYYWEF-UHFFFAOYSA-N

AC$INSTRUMENT: ZQ, Waters
AC$INSTRUMENT_TYPE: LC-ESI-Q
AC$MASS_SPECTROMETRY: MS_TYPE MS
AC$MASS_SPECTROMETRY: ION_MODE POSITIVE
AC$MASS_SPECTROMETRY: IONIZATION ESI
AC$CHROMATOGRAPHY: RETENTION_TIME 13.900 min
AC$CHROMATOGRAPHY: COLUMN_NAME 2.1 mm id - 3. 5{mu}m XTerra C18MS
AC$CHROMATOGRAPHY: COLUMN_TEMPERATURE 35 C
AC$CHROMATOGRAPHY: SAMPLING_CONE 75 V, 90 V

MS$DATA_PROCESSING: FIND_PEAK ignore rel.int. < 5

PK$SPLASH: splash10-0006-0390000000-4744aef13b9fae01113c
PK$NUM_PEAK: 116
PK$PEAK: m/z int. rel.int.
  100 16 16
  101 35 35
  102 8 8
  117 20 20
  124 12 12
  127 12 12
  130 8 8
  131 8 8
  133 67 67
  134 8 8
  145 8 8
  146 8 8
  154 12 12
  156 8 8
  157 8 8
  159 16 16
  164 8 8
  165 8 8
  166 8 8
  168 8 8
  172 24 24
  173 12 12
  177 27 27
  179 16 16
  180 8 8
  181 86 86
  182 12 12
  183 8 8
  191 20 20
  192 999 999
  193 141 141
  194 20 20
  200 43 43
  202 12 12
  203 12 12
  205 20 20
  206 27 27
  207 43 43
  208 141 141
  209 82 82
  210 63 63
  214 12 12
  215 106 106
  216 39 39
  217 43 43
  218 39 39
  219 24 24
  220 35 35
  221 51 51
  222 12 12
  226 24 24
  227 368 368
  228 129 129
  229 161 161
  230 47 47
  231 20 20
  232 24 24
  233 31 31
  234 27 27
  235 8 8
  236 8 8
  239 59 59
  240 47 47
  241 74 74
  242 35 35
  243 560 560
  244 192 192
  245 255 255
  246 90 90
  247 39 39
  248 20 20
  249 8 8
  250 8 8
  253 71 71
  254 43 43
  255 67 67
  256 388 388
  257 67 67
  258 118 118
  259 27 27
  260 8 8
  261 8 8
  262 8 8
  263 16 16
  265 8 8
  267 12 12
  268 153 153
  269 47 47
  270 98 98
  271 39 39
  272 20 20
  273 8 8
  280 12 12
  281 12 12
  282 98 98
  283 20 20
  284 39 39
  285 12 12
  286 8 8
  291 12 12
  294 16 16
  296 200 200
  297 43 43
  298 55 55
  299 86 86
  300 16 16
  301 27 27
  312 12 12
  314 8 8
  325 31 31
  326 20 20
  327 16 16
  341 8 8
  343 39 39
  344 8 8
  345 16 16