ACCESSION: MSBNK-Waters-WA001029
RECORD_TITLE: Diacetylmorphine (Heroin); LC-ESI-Q; MS; POS; 60 V
DATE: 2016.01.19 (Created 2007.08.01, modified 2011.05.06)
AUTHORS: Nihon Waters K.K.
LICENSE: CC BY-NC

CH$NAME: Diacetylmorphine (Heroin)
CH$COMPOUND_CLASS: N/A
CH$FORMULA: C21H23NO5
CH$EXACT_MASS: 369.15762
CH$SMILES: CC(=O)Oc(c5)c(O4)c(c(c5)1)C(C2)(C34)C([H])(C=CC(OC(C)=O)3)C(N(C)C2)C1
CH$IUPAC: InChI=1S/C21H23NO5/c1-11(23)25-16-6-4-13-10-15-14-5-7-17(26-12(2)24)20-21(14,8-9-22(15)3)18(13)19(16)27-20/h4-7,14-15,17,20H,8-10H2,1-3H3/t14-,15+,17-,20-,21-/m0/s1
CH$LINK: CAS 561-27-3
CH$LINK: INCHIKEY GVGLGOZIDCSQPN-PVHGPHFFSA-N
CH$LINK: COMPTOX DTXSID6046761

AC$INSTRUMENT: ZQ, Waters
AC$INSTRUMENT_TYPE: LC-ESI-Q
AC$MASS_SPECTROMETRY: MS_TYPE MS
AC$MASS_SPECTROMETRY: ION_MODE POSITIVE
AC$MASS_SPECTROMETRY: IONIZATION ESI
AC$CHROMATOGRAPHY: RETENTION_TIME 11.650 min
AC$CHROMATOGRAPHY: COLUMN_NAME 2.1 mm id - 3. 5{mu}m XTerra C18MS
AC$CHROMATOGRAPHY: COLUMN_TEMPERATURE 35 C
AC$CHROMATOGRAPHY: SAMPLING_CONE 60 V

MS$DATA_PROCESSING: FIND_PEAK ignore rel.int. < 5

PK$SPLASH: splash10-00di-0029000000-b17c5c637537af0ecfde
PK$NUM_PEAK: 26
PK$PEAK: m/z int. rel.int.
  165 8 8
  181 8 8
  191 8 8
  193 31 31
  203 8 8
  207 8 8
  209 24 24
  211 78 78
  212 8 8
  219 20 20
  225 8 8
  229 8 8
  237 31 31
  239 8 8
  240 8 8
  253 8 8
  268 118 118
  269 20 20
  286 8 8
  310 51 51
  311 12 12
  328 98 98
  329 16 16
  370 999 999
  371 239 239
  372 27 27