ACCESSION: MSBNK-Waters-WA000976
RECORD_TITLE: Desmethylcitalopram; LC-ESI-Q; MS; POS; 15 V, 30 V
DATE: 2016.01.19 (Created 2007.08.01, modified 2011.05.06)
AUTHORS: Nihon Waters K.K.
LICENSE: CC BY-NC

CH$NAME: Desmethylcitalopram
CH$COMPOUND_CLASS: N/A
CH$FORMULA: C19H19FN2O
CH$EXACT_MASS: 310.14814
CH$SMILES: CNCCCC(O1)(c(c3)ccc(F)c3)c(c2)c(cc(C#N)c2)C1
CH$IUPAC: InChI=1S/C19H19FN2O/c1-22-10-2-9-19(16-4-6-17(20)7-5-16)18-8-3-14(12-21)11-15(18)13-23-19/h3-8,11,22H,2,9-10,13H2,1H3/t19-/m0/s1
CH$LINK: CAS 144010-85-5
CH$LINK: INCHIKEY PTJADDMMFYXMMG-IBGZPJMESA-N

AC$INSTRUMENT: ZQ, Waters
AC$INSTRUMENT_TYPE: LC-ESI-Q
AC$MASS_SPECTROMETRY: MS_TYPE MS
AC$MASS_SPECTROMETRY: ION_MODE POSITIVE
AC$MASS_SPECTROMETRY: IONIZATION ESI
AC$CHROMATOGRAPHY: RETENTION_TIME 13.450 min
AC$CHROMATOGRAPHY: COLUMN_NAME 2.1 mm id - 3. 5{mu}m XTerra C18MS
AC$CHROMATOGRAPHY: COLUMN_TEMPERATURE 35 C
AC$CHROMATOGRAPHY: SAMPLING_CONE 15 V, 30 V

MS$DATA_PROCESSING: FIND_PEAK ignore rel.int. < 5

PK$SPLASH: splash10-03di-0009000000-adea26aa7d3f3c2a0cca
PK$NUM_PEAK: 10
PK$PEAK: m/z int. rel.int.
  101 8 8
  109 24 24
  262 55 55
  263 8 8
  280 20 20
  293 16 16
  311 999 999
  312 184 184
  313 16 16
  352 8 8