ACCESSION: MSBNK-Waters-WA000937
RECORD_TITLE: Buflomedil; LC-ESI-Q; MS; POS; 30 V
DATE: 2016.01.19 (Created 2007.08.01, modified 2011.05.06)
AUTHORS: Nihon Waters K.K.
LICENSE: CC BY-NC

CH$NAME: Buflomedil
CH$COMPOUND_CLASS: N/A
CH$FORMULA: C17H25NO4
CH$EXACT_MASS: 307.17836
CH$SMILES: COc(c1)cc(OC)c(C(=O)CCCN(C2)CCC2)c(OC)1
CH$IUPAC: InChI=1S/C17H25NO4/c1-20-13-11-15(21-2)17(16(12-13)22-3)14(19)7-6-10-18-8-4-5-9-18/h11-12H,4-10H2,1-3H3
CH$LINK: CAS 55837-25-7
CH$LINK: INCHIKEY OWYLAEYXIQKAOL-UHFFFAOYSA-N
CH$LINK: COMPTOX DTXSID5022697

AC$INSTRUMENT: ZQ, Waters
AC$INSTRUMENT_TYPE: LC-ESI-Q
AC$MASS_SPECTROMETRY: MS_TYPE MS
AC$MASS_SPECTROMETRY: ION_MODE POSITIVE
AC$MASS_SPECTROMETRY: IONIZATION ESI
AC$CHROMATOGRAPHY: RETENTION_TIME 11.670 min
AC$CHROMATOGRAPHY: COLUMN_NAME 2.1 mm id - 3. 5{mu}m XTerra C18MS
AC$CHROMATOGRAPHY: COLUMN_TEMPERATURE 35 C
AC$CHROMATOGRAPHY: SAMPLING_CONE 30 V

MS$DATA_PROCESSING: FIND_PEAK ignore rel.int. < 5

PK$SPLASH: splash10-0a4l-0529000000-20c1150826858e28eef3
PK$NUM_PEAK: 11
PK$PEAK: m/z int. rel.int.
  101 8 8
  107 31 31
  140 642 642
  141 43 43
  163 8 8
  237 239 239
  238 27 27
  290 12 12
  308 999 999
  309 161 161
  310 20 20