ACCESSION: MSBNK-Washington_State_Univ-BML80538
RECORD_TITLE: 6-Chloropurine riboside; LC-APCI-QTOF; MS; NEGATIVE
DATE: 2016.01.19 (Created 2012.10.26)
AUTHORS: Cuthbertson DJ, Johnson SR, Lange BM, Institute of Biological Chemistry, Washington State University
LICENSE: CC BY-SA
COMMENT: relative retention time with respect to 9-anthracene Carboxylic Acid is 0.348

CH$NAME: 6-Chloropurine riboside
CH$COMPOUND_CLASS: N/A
CH$FORMULA: C10H11ClN4O4
CH$EXACT_MASS: 286.046883
CH$SMILES: C1=NC2=C(C(=N1)Cl)N=CN2C3C(C(C(O3)CO)O)O
CH$IUPAC: InChI=1S/C10H11ClN4O4/c11-8-5-9(13-2-12-8)15(3-14-5)10-7(18)6(17)4(1-16)19-10/h2-4,6-7,10,16-18H,1H2
CH$LINK: CAS 2004-06-0
CH$LINK: CHEMSPIDER 191782
CH$LINK: PUBCHEM CID:221074
CH$LINK: INCHIKEY XHRJGHCQQPETRH-UHFFFAOYSA-N

AC$INSTRUMENT: Agilent 1200 RRLC; Agilent 6520 QTOF
AC$INSTRUMENT_TYPE: LC-APCI-QTOF
AC$MASS_SPECTROMETRY: MS_TYPE MS
AC$MASS_SPECTROMETRY: ION_MODE NEGATIVE
AC$MASS_SPECTROMETRY: SCANNING m/z 100-1000
AC$CHROMATOGRAPHY: COLUMN_NAME Agilent C8 Cartridge Column 2.1X30mm 3.5 micron (guard); Agilent SB-Aq 2.1x50mm 1.8 micron (analytical)
AC$CHROMATOGRAPHY: COLUMN_TEMPERATURE 60 C
AC$CHROMATOGRAPHY: FLOW_GRADIENT linear from 98A/2B at 0 min to 2A/98B at 13 min, hold 6 min at 2A/98B, reequilibration 98A/2B (5 min)
AC$CHROMATOGRAPHY: FLOW_RATE 0.6 ml/min
AC$CHROMATOGRAPHY: RETENTION_TIME 2.577
AC$CHROMATOGRAPHY: SOLVENT A water with 0.2% acetic acid
AC$CHROMATOGRAPHY: SOLVENT B methanol with 0.2% acetic acid

PK$SPLASH: splash10-000i-0090000000-fdadbc14669d40d60cec
PK$NUM_PEAK: 1
PK$PEAK: m/z int. rel.int.
  285.0396235 4410 999