ACCESSION: MSBNK-RIKEN_NPDepo-CB000491
RECORD_TITLE: Foetoside C; LC-ESI-QQQ; MS; [M+H]+
DATE: 2018.04.04
AUTHORS: Nogawa T, Okano A, CSRS, RIKEN
LICENSE: CC BY
COMMENT: Origin: Plant
COMMENT: SubCategory_DNP: Triterpenoids

CH$NAME: Foetoside C
CH$COMPOUND_CLASS: Terpenoids
CH$FORMULA: C58H94O25
CH$EXACT_MASS: 1191.3809
CH$SMILES: CC1OC(OC2C(OC3CC[C@@]4(C)C(CC[C@]5(C)C4CC=C4C6CC(C)(C)CCC6(C(=O)OC6OC(COC7OC(CO)C(O)C(O)C7O)C(O)C(O)C6O)CC[C@]45C)C3(C)C)OCC(O)C2O)C(O)C(OC2OCC(O)C(O)C2O)C1O
CH$IUPAC: InChI=1S/C58H94O25/c1-24-34(62)45(81-48-41(69)35(63)27(60)21-74-48)44(72)50(77-24)82-46-36(64)28(61)22-75-51(46)80-33-12-13-55(6)31(54(33,4)5)11-14-57(8)32(55)10-9-25-26-19-53(2,3)15-17-58(26,18-16-56(25,57)7)52(73)83-49-43(71)40(68)38(66)30(79-49)23-76-47-42(70)39(67)37(65)29(20-59)78-47/h9,24,26-51,59-72H,10-23H2,1-8H3/t24?,26?,27?,28?,29?,30?,31?,32?,33?,34?,35?,36?,37?,38?,39?,40?,41?,42?,43?,44?,45?,46?,47?,48?,49?,50?,51?,55-,56+,57+,58?/m0/s1
CH$LINK: CAS 94483-11-1
CH$LINK: INCHIKEY BGKLFKHHSFCDKC-KPHKKTKMSA-N
CH$LINK: PUBCHEM CID:44661022

AC$INSTRUMENT: ABSciex API3200 LC/MS system
AC$INSTRUMENT_TYPE: LC-ESI-QQQ
AC$MASS_SPECTROMETRY: MS_TYPE MS
AC$MASS_SPECTROMETRY: ION_MODE POSITIVE

MS$FOCUSED_ION: PRECURSOR_TYPE [M+H]+

PK$SPLASH: splash10-0006-0910100000-ced86f009197f4514c13
PK$NUM_PEAK: 183
PK$PEAK: m/z int. rel.int.
  134.8000 8589.0811 21
  141.9000 13785.6152 35
  142.0000 26628.8320 68
  142.1000 28459.7520 73
  142.2000 51076.7461 132
  142.3000 40522.1523 105
  154.7000 9585.3047 24
  220.5000 10608.4531 26
  220.7000 17662.8145 45
  220.9000 27059.6367 69
  278.8000 8992.9531 22
  279.2000 14324.1064 36
  324.8000 10150.7256 25
  432.8000 16101.1592 41
  438.6000 12223.9502 31
  438.7000 17555.1035 44
  438.8000 56542.5117 147
  438.9000 27221.1797 70
  439.0000 24905.6289 64
  439.1000 23774.7773 61
  439.2000 26009.5527 67
  439.3000 22913.1797 59
  439.4000 23047.8047 59
  439.5000 15912.6758 40
  439.6000 13220.1777 33
  439.7000 11658.5283 29
  439.8000 11954.7012 30
  439.9000 11523.9023 29
  440.0000 8750.6250 21
  440.4000 9019.8770 22
  440.5000 15051.0762 38
  440.6000 16289.6270 41
  440.7000 14081.7754 35
  440.8000 17716.6504 45
  440.9000 17447.4023 44
  441.0000 16316.5527 41
  441.1000 17851.2773 45
  441.2000 18120.5273 46
  441.3000 9881.4766 24
  456.8000 10662.3008 26
  457.0000 9719.9258 24
  470.6000 11093.1006 28
  573.0000 10796.9258 27
  602.4000 9693.0000 24
  602.6000 18416.7012 47
  602.7000 18282.0762 46
  602.8000 23209.3516 59
  602.9000 12708.6035 32
  603.0000 25282.5781 65
  603.1000 21243.8281 54
  603.2000 18282.0762 46
  603.3000 14781.8262 37
  603.5000 9396.8252 23
  603.8000 9396.8271 23
  734.5000 10527.6777 26
  734.6000 12089.3271 30
  734.7000 20516.8535 52
  734.8000 35406.3906 91
  734.9000 31583.0313 81
  735.0000 22617.0039 58
  735.1000 20193.7520 51
  735.2000 14485.6504 36
  735.3000 21324.6016 54
  735.9000 9854.5518 24
  866.9000 14997.2275 38
  1028.8000 10096.8750 25
  1029.0000 8562.1504 21
  1029.1000 21028.4297 54
  1029.2000 15131.8535 38
  1029.3000 9693.0000 24
  1029.4000 15724.2031 40
  1029.5000 9827.6260 24
  1029.7000 10393.0518 26
  1029.8000 9100.6504 22
  1030.0000 8589.0762 21
  1030.2000 9262.2012 23
  1030.3000 11927.7764 30
  1058.5000 10823.8516 27
  1058.6000 8454.4502 21
  1058.7000 12143.1777 30
  1058.8000 22213.1289 57
  1058.9000 17716.6523 45
  1059.0000 17743.5781 45
  1059.1000 14377.9521 36
  1059.2000 14108.7021 35
  1059.3000 18955.2031 48
  1059.4000 19547.5527 50
  1059.5000 11146.9502 28
  1059.6000 14620.2764 37
  1060.1000 10177.6523 25
  1125.5000 8992.9502 22
  1126.0000 8427.5264 21
  1134.0000 12385.5020 31
  1190.3000 16989.6777 43
  1190.4000 47226.4570 122
  1190.5000 69089.5625 179
  1190.6000 89471.7891 233
  1190.7000 106999.9609 279
  1190.8000 131690.2031 343
  1190.9000 185459.4375 484
  1191.0000 152718.6250 398
  1191.1000 176278.0156 460
  1191.2000 178593.5625 466
  1191.3000 191786.8125 501
  1191.4000 381823.5000 999
  1191.5000 211819.0000 553
  1191.6000 135001.9688 352
  1191.7000 122616.4766 320
  1191.8000 120570.1797 314
  1191.9000 118093.0781 308
  1192.0000 121243.2813 316
  1192.1000 116719.8984 304
  1192.2000 104253.6094 272
  1192.3000 101291.8594 264
  1192.4000 99326.3359 259
  1192.5000 95206.8203 248
  1192.6000 73020.6172 190
  1192.7000 53742.3086 139
  1192.8000 49407.3828 128
  1192.9000 48734.2539 126
  1193.0000 69708.8281 181
  1193.1000 41733.7617 108
  1193.2000 44991.6797 116
  1193.3000 65966.2656 171
  1193.4000 39741.3047 103
  1193.5000 24151.7285 62
  1193.6000 19574.4785 50
  1193.7000 14027.9287 35
  1193.8000 14458.7275 36
  1193.9000 17958.9785 46
  1194.0000 13893.3027 35
  1194.1000 13785.6025 35
  1194.2000 11793.1523 29
  1194.3000 11523.9023 29
  1194.4000 10823.8516 27
  1194.5000 11227.7256 28
  1199.4000 11362.3506 28
  1199.5000 10527.6777 26
  1199.6000 21459.2305 55
  1199.7000 9827.6260 24
  1199.8000 20759.1797 53
  1199.9000 16558.8770 42
  1200.0000 15858.8262 40
  1200.1000 15158.7754 38
  1200.2000 12924.0010 32
  1200.3000 12358.5762 31
  1200.4000 13462.5039 34
  1200.5000 18685.9512 47
  1200.6000 8992.9502 22
  1200.7000 8562.1504 21
  1200.8000 16397.3281 41
  1200.9000 11927.7773 30
  1201.0000 10096.8760 25
  1201.1000 8696.7764 21
  1201.4000 11362.3506 28
  1207.6000 25067.1777 64
  1207.7000 16262.7031 41
  1207.8000 20759.1816 53
  1207.9000 24851.7773 64
  1208.0000 25255.6543 65
  1208.1000 13650.9805 34
  1208.2000 22240.0527 57
  1208.3000 21782.3281 56
  1208.4000 24097.8770 62
  1208.5000 37371.9023 96
  1208.6000 30317.5508 78
  1208.7000 34329.3789 88
  1208.8000 20893.8066 53
  1208.9000 28190.4785 72
  1209.0000 20759.1816 53
  1209.1000 34006.2773 88
  1209.2000 23236.2793 59
  1209.3000 29859.8320 77
  1209.4000 15374.1777 39
  1209.5000 19143.6758 49
  1209.6000 14377.9521 36
  1209.7000 10716.1514 27
  1209.9000 10123.8008 25
  1210.1000 13812.5264 35
  1210.2000 9719.9258 24
  1210.3000 8454.4502 21
  1210.4000 13085.5518 33
  1210.5000 10419.9756 26