ACCESSION: MSBNK-RIKEN_NPDepo-CB000405
RECORD_TITLE: Alloside B; LC-ESI-QQQ; MS; [M+H]+
DATE: 2018.04.04
AUTHORS: Nogawa T, Okano A, CSRS, RIKEN
LICENSE: CC BY
COMMENT: Origin: Plant
COMMENT: SubCategory_DNP: The sterols, Cholestanes

CH$NAME: Alloside B
CH$COMPOUND_CLASS: Steroids
CH$FORMULA: C39H66O14
CH$EXACT_MASS: 758.9525
CH$SMILES: CC(C)CCC(O)[C@@H](C)C1C(O[C@@H]2OC(CO)[C@@H](O)C(O)C2O)CC2C3CC=C4C[C@@H](O)CC(O[C@@H]5OC(CO)[C@@H](O)C(O)C5O)[C@]4(C)C3CC[C@@]21C
CH$IUPAC: InChI=1S/C39H66O14/c1-17(2)6-9-24(43)18(3)29-25(50-36-34(48)32(46)30(44)26(15-40)51-36)14-23-21-8-7-19-12-20(42)13-28(39(19,5)22(21)10-11-38(23,29)4)53-37-35(49)33(47)31(45)27(16-41)52-37/h7,17-18,20-37,40-49H,6,8-16H2,1-5H3/t18-,20-,21?,22?,23?,24?,25?,26?,27?,28?,29?,30-,31-,32?,33?,34?,35?,36-,37+,38+,39+/m1/s1
CH$LINK: CAS 142735-55-5
CH$LINK: CHEMSPIDER 2331841
CH$LINK: INCHIKEY JPJDIOVDAAVUNF-JCBACFEVSA-N

AC$INSTRUMENT: ABSciex API3200 LC/MS system
AC$INSTRUMENT_TYPE: LC-ESI-QQQ
AC$MASS_SPECTROMETRY: MS_TYPE MS
AC$MASS_SPECTROMETRY: ION_MODE POSITIVE

MS$FOCUSED_ION: PRECURSOR_TYPE [M+H]+

PK$SPLASH: splash10-0a4i-0205010900-0dd4e4bcb8aa390dda91
PK$NUM_PEAK: 228
PK$PEAK: m/z int. rel.int.
  100.9000 246475.9063 439
  101.0000 112117.3438 199
  101.1000 226787.0469 404
  101.2000 149635.6875 266
  101.3000 180554.6406 321
  101.4000 186278.9688 331
  101.5000 72848.9609 129
  101.6000 15058.3643 25
  102.4000 14146.8428 24
  117.1000 19944.1328 34
  120.7000 13454.0859 23
  134.6000 13417.6260 22
  135.0000 22095.3301 38
  141.8000 21293.2148 37
  141.9000 241480.8594 430
  142.0000 331320.5313 590
  146.6000 12542.5625 21
  149.3000 12433.1699 21
  161.5000 13271.7793 22
  199.5000 27272.7793 47
  220.6000 128488.3281 228
  221.3000 100158.1953 177
  221.4000 56477.9961 99
  224.9000 16298.0381 28
  238.5000 12834.2500 21
  238.8000 26288.3320 45
  252.7000 13053.0156 22
  270.9000 13599.9287 23
  271.0000 13053.0166 22
  271.1000 20162.8984 35
  271.2000 34601.4297 60
  271.3000 14256.2256 24
  271.4000 16808.4922 29
  279.5000 12542.5625 21
  279.8000 14839.6006 25
  311.2000 12396.7188 21
  324.9000 19360.7578 33
  330.2000 23918.3691 41
  330.3000 17683.5508 30
  356.3000 12907.1719 22
  363.3000 13235.3203 22
  363.5000 13235.3203 22
  364.9000 21694.2559 37
  365.0000 18923.2266 32
  365.1000 12360.2549 21
  365.2000 19360.7578 33
  365.4000 26580.0195 46
  365.5000 14803.1387 25
  365.6000 13344.7002 22
  365.9000 15787.5850 27
  380.6000 34018.0508 59
  380.7000 77041.9531 136
  380.8000 60379.3086 106
  380.9000 67744.4141 119
  381.0000 80068.2188 141
  381.1000 75948.1172 134
  381.2000 79047.3047 140
  381.3000 55602.9258 98
  381.4000 64280.6250 113
  381.5000 51154.6875 90
  381.6000 37591.2148 66
  381.7000 20017.0547 34
  381.8000 28585.3730 50
  381.9000 21913.0215 38
  382.0000 36023.4023 63
  382.1000 41127.9414 72
  382.2000 25704.9551 44
  382.3000 34018.0508 59
  382.4000 13344.7031 22
  382.5000 29351.0508 51
  382.6000 31137.6387 54
  382.7000 82182.9453 145
  382.8000 86740.5703 153
  382.9000 84625.8281 150
  383.0000 76531.5078 135
  383.1000 84990.4453 150
  383.2000 152880.6875 272
  383.3000 364427.0313 649
  383.4000 95418.2734 169
  383.5000 73505.2422 130
  383.6000 34382.6602 60
  383.7000 58702.1016 103
  383.8000 63150.3398 111
  383.9000 36023.4023 63
  384.0000 49039.9531 86
  384.1000 33471.1406 58
  384.2000 14474.9912 24
  384.3000 16808.4922 29
  384.5000 29278.1289 51
  398.6000 29934.4258 52
  398.7000 75073.0547 133
  398.8000 110294.3203 195
  398.9000 99428.9609 176
  399.0000 96439.1797 171
  399.1000 109309.8750 194
  399.2000 105080.4063 186
  399.3000 113211.1953 201
  399.4000 99319.5781 176
  399.5000 77406.5703 137
  399.6000 46706.4609 82
  399.7000 31356.4023 55
  399.8000 22241.1699 38
  399.9000 37919.3672 66
  400.0000 40690.4102 71
  400.1000 23699.6094 41
  400.2000 14912.5225 25
  400.3000 35695.2539 62
  400.4000 22350.5547 38
  400.5000 26689.4063 46
  400.9000 12907.1689 22
  401.0000 17574.1699 30
  401.1000 12797.7891 21
  401.2000 14912.5225 25
  401.3000 17464.7871 30
  401.4000 17027.2578 29
  402.1000 13125.9375 22
  416.8000 21584.8730 37
  417.0000 39377.8164 69
  417.1000 60707.4570 107
  417.2000 27710.3105 48
  417.3000 16699.1074 28
  417.4000 24246.5195 42
  417.5000 23808.9883 41
  418.0000 13125.9375 22
  433.1000 29897.9668 52
  507.3000 13235.3203 22
  543.1000 13235.3203 22
  543.3000 13454.0859 23
  560.7000 15568.8193 26
  560.8000 51701.6016 91
  560.9000 28475.9902 49
  561.0000 41820.6914 73
  561.1000 29825.0449 52
  561.2000 32377.3086 56
  561.3000 35367.1055 62
  561.4000 37481.8359 65
  561.5000 24246.5234 42
  561.7000 15787.5850 27
  561.8000 17792.9355 30
  562.0000 20345.2051 35
  562.3000 13672.8506 23
  562.4000 15131.2881 26
  563.3000 13016.5518 22
  578.7000 30481.3418 53
  578.8000 41273.7773 72
  578.9000 31064.7148 54
  579.0000 39596.5781 69
  579.1000 34492.0430 60
  579.2000 29387.5137 51
  579.3000 34820.1914 61
  579.4000 16261.5771 28
  579.5000 24829.8945 43
  579.8000 27017.5547 47
  579.9000 17792.9355 30
  580.0000 20126.4395 34
  580.2000 13454.0859 23
  580.3000 12907.1719 22
  580.4000 13016.5547 22
  580.5000 13344.7031 22
  722.8000 29460.4355 51
  723.1000 55457.0820 98
  723.2000 25230.9688 44
  740.7000 13016.5547 22
  740.8000 24684.0547 43
  740.9000 31793.9336 55
  741.0000 15240.6699 26
  741.1000 31247.0195 54
  741.2000 26361.2539 46
  741.3000 28694.7559 50
  741.4000 17464.7871 30
  742.0000 20454.5859 35
  742.3000 18339.8496 31
  758.5000 27418.6211 47
  758.6000 115690.5391 205
  758.7000 226021.3594 402
  758.8000 250814.7813 446
  758.9000 352322.0000 628
  759.0000 382475.2188 682
  759.1000 352103.2813 627
  759.2000 364317.6250 649
  759.3000 334383.2500 596
  759.4000 243121.5156 433
  759.5000 222630.4531 396
  759.6000 106866.9844 189
  759.7000 124003.6328 220
  759.8000 134358.5469 238
  759.9000 231563.4063 412
  760.0000 559930.5625 999
  760.1000 164912.8125 293
  760.2000 144676.9844 257
  760.3000 123347.3359 219
  760.4000 103038.6094 183
  760.5000 80870.3516 143
  760.6000 30809.4883 54
  760.7000 25158.0410 43
  760.8000 38174.6016 67
  760.9000 59941.7773 106
  761.0000 42294.6836 74
  761.1000 58847.9492 104
  761.2000 47727.3672 84
  761.3000 18048.1641 31
  761.4000 42367.6133 74
  761.6000 17902.3184 30
  762.1000 19688.9082 34
  775.6000 45393.8672 80
  775.7000 44628.1836 78
  775.8000 56003.9883 99
  775.9000 49112.8750 86
  776.0000 78901.4531 139
  776.1000 84224.7656 149
  776.2000 83349.7031 147
  776.3000 198201.6094 352
  776.4000 103366.7344 183
  776.5000 30845.9512 54
  776.6000 36825.5391 64
  776.7000 49039.9609 86
  776.8000 39924.7266 70
  776.9000 37372.4531 65
  777.0000 27382.1621 47
  777.1000 34163.8945 60
  777.2000 33616.9844 59
  777.3000 34054.5156 59
  777.4000 32486.6914 57
  777.5000 21037.9609 36
  777.6000 16589.7266 28
  778.0000 12469.6406 21
  778.1000 24246.5195 42
  778.3000 24355.9023 42