ACCESSION: MSBNK-RIKEN_NPDepo-CB000375
RECORD_TITLE: Androstenedione; LC-ESI-QQQ; MS; [M+H]+
DATE: 2018.04.04
AUTHORS: Nogawa T, Okano A, CSRS, RIKEN
LICENSE: CC BY
COMMENT: Origin: Animal
COMMENT: SubCategory_DNP: The sterols, Androstanes

CH$NAME: Androstenedione
CH$COMPOUND_CLASS: Steroids
CH$FORMULA: C19H26O2
CH$EXACT_MASS: 286.4179
CH$SMILES: C[C@]12CCC3C(CCC4=CC(=O)CC[C@@]43C)C1CCC2=O
CH$IUPAC: InChI=1S/C19H26O2/c1-18-9-7-13(20)11-12(18)3-4-14-15-5-6-17(21)19(15,2)10-8-16(14)18/h11,14-16H,3-10H2,1-2H3/t14?,15?,16?,18-,19-/m0/s1
CH$LINK: CAS 63-05-8
CH$LINK: CHEMSPIDER 5898
CH$LINK: INCHIKEY AEMFNILZOJDQLW-WFZCBACDSA-N
CH$LINK: COMPTOX DTXSID40424100
CH$LINK: PUBCHEM CID:6432604

AC$INSTRUMENT: ABSciex API3200 LC/MS system
AC$INSTRUMENT_TYPE: LC-ESI-QQQ
AC$MASS_SPECTROMETRY: MS_TYPE MS
AC$MASS_SPECTROMETRY: ION_MODE POSITIVE

MS$FOCUSED_ION: PRECURSOR_TYPE [M+H]+

PK$SPLASH: splash10-000i-0091000000-132daaff3da287a768f7
PK$NUM_PEAK: 100
PK$PEAK: m/z int. rel.int.
  101.1000 322871.5625 34
  101.2000 261776.2813 27
  101.3000 246396.4375 26
  101.4000 228470.8906 24
  108.5000 566510.1875 61
  108.6000 928414.8125 101
  108.7000 1157310.1250 127
  108.8000 1999809.5000 220
  108.9000 976145.3750 107
  109.0000 991949.7500 108
  109.1000 1044983.6875 114
  109.2000 1008708.5625 110
  109.3000 1116473.5000 122
  109.4000 1208753.1250 132
  109.5000 416529.7813 45
  110.1000 216273.0156 22
  123.3000 203226.6406 21
  172.7000 209484.6563 22
  172.8000 241305.0938 25
  210.6000 204499.4688 21
  210.7000 251699.7656 26
  250.9000 277898.6250 29
  268.6000 219561.1406 23
  268.7000 289460.0313 31
  268.8000 529810.5000 57
  268.9000 297945.5313 31
  269.4000 226349.4844 24
  269.5000 229001.2188 24
  286.4000 1087304.8750 119
  286.5000 5783686.0000 638
  286.6000 7648257.5000 845
  286.7000 8886180.0000 982
  286.8000 8918955.0000 985
  286.9000 8820525.0000 975
  287.0000 9037010.0000 999
  287.1000 8684757.0000 960
  287.2000 8631618.0000 954
  287.3000 8262183.0000 913
  287.4000 7663320.5000 846
  287.5000 6590546.5000 728
  287.6000 4078746.2500 450
  287.7000 3491021.7500 385
  287.8000 3431517.7500 378
  287.9000 3862579.5000 426
  288.0000 3759056.7500 414
  288.1000 3792998.5000 418
  288.2000 3671125.5000 405
  288.3000 3496113.7500 385
  288.4000 3214396.5000 354
  288.5000 2704738.5000 298
  288.6000 1152006.5000 126
  288.7000 925763.1875 101
  288.8000 772918.7500 84
  288.9000 583056.8125 63
  289.0000 696867.9375 76
  289.1000 583375.0000 63
  289.2000 651682.9375 71
  289.3000 626650.8750 68
  289.4000 554418.3750 60
  289.5000 472215.5938 51
  327.5000 708005.1250 77
  327.6000 1287667.7500 141
  327.7000 1456210.1250 160
  327.8000 1468726.2500 161
  327.9000 1379946.8750 151
  328.0000 1599932.2500 176
  328.1000 1415267.8750 155
  328.2000 1476999.3750 162
  328.3000 1343459.6250 147
  328.4000 1384508.1250 152
  328.5000 1097169.1250 120
  328.6000 568631.5625 61
  328.7000 441137.5625 47
  328.8000 408256.4688 44
  328.9000 376542.0000 40
  329.0000 320750.1563 34
  329.1000 388527.7500 41
  329.2000 348540.0313 37
  329.3000 327856.7500 35
  329.4000 227198.0625 24
  572.6000 241517.2813 25
  572.7000 611907.3750 66
  572.8000 891927.3125 97
  572.9000 952067.9375 104
  573.0000 1004359.5625 110
  573.1000 973069.5000 106
  573.2000 898927.8750 98
  573.3000 905928.3125 99
  573.4000 678624.1875 74
  573.5000 472109.4375 51
  573.6000 262306.6563 28
  573.7000 276519.7813 29
  573.8000 387679.2500 41
  573.9000 293808.8750 31
  574.0000 346312.6250 37
  574.1000 388315.5938 41
  574.2000 392027.9688 42
  574.3000 378027.0000 40
  574.4000 307809.8750 33
  574.5000 206302.6094 21