ACCESSION: MSBNK-RIKEN_NPDepo-CB000318
RECORD_TITLE: epicatechin; LC-ESI-QQQ; MS; [M+H]+
DATE: 2018.04.04
AUTHORS: Nogawa T, Okano A, CSRS, RIKEN
LICENSE: CC BY
COMMENT: Origin: Plant
COMMENT: Formula(Parent): C15H14O6
COMMENT: Bottle Name:(+)-Epicatechin / (-)-Epicatechin
COMMENT: PRIME Parent Name:(+)-Epicatechin / (-)-Epicatechin
COMMENT: PRIME in-house No.:?T0003 T0004, Pyrans (?T0003: (+)-Epicatechin, ?T0004: (-)-Epicatechin)

CH$NAME: EpCt-pl
CH$NAME: ent-Epicatechin
CH$NAME: Epicatechol
CH$NAME: (+)-3,3',4',5,7-Pentahydroxyflavan
CH$NAME: (2S,3S)-(+)-Epicatechin / EpCt-mi
CH$NAME: (-)-3,3',4',5,7-Pentahydroxyflavan
CH$NAME: (2R,3R)-(-)-Epicatechin
CH$NAME: epicatechin
CH$COMPOUND_CLASS: Flavonoids
CH$FORMULA: C15H14O6
CH$EXACT_MASS: 290.2752
CH$SMILES: C1C(C(OC2=CC(=CC(=C21)O)O)C3=CC(=C(C=C3)O)O)O
CH$IUPAC: InChI=1S/C15H14O6/c16-8-4-11(18)9-6-13(20)15(21-14(9)5-8)7-1-2-10(17)12(19)3-7/h1-5,13,15-20H,6H2
CH$LINK: CAS 35323-91-2 490-46-0
CH$LINK: CHEMSPIDER 65230
CH$LINK: INCHIKEY PFTAWBLQPZVEMU-UHFFFAOYSA-N
CH$LINK: COMPTOX DTXSID4045133
CH$LINK: PUBCHEM CID:72276

AC$INSTRUMENT: ABSciex API3200 LC/MS system
AC$INSTRUMENT_TYPE: LC-ESI-QQQ
AC$MASS_SPECTROMETRY: MS_TYPE MS
AC$MASS_SPECTROMETRY: ION_MODE POSITIVE

MS$FOCUSED_ION: PRECURSOR_TYPE [M+H]+

PK$SPLASH: splash10-0006-0980010000-3aa90cb5a503be98d4b2
PK$NUM_PEAK: 156
PK$PEAK: m/z int. rel.int.
  102.2000 53971.5898 23
  102.3000 63004.4922 27
  102.4000 83780.1641 36
  114.4000 60520.4453 25
  118.7000 53519.9414 22
  118.8000 197368.8906 87
  118.9000 694856.0000 308
  119.0000 1065656.7500 474
  119.1000 1487041.7500 662
  119.2000 1302770.3750 580
  119.3000 962681.5000 428
  119.4000 705695.4375 313
  119.5000 460452.2813 204
  119.6000 154010.9844 67
  119.7000 106136.6016 46
  119.8000 148365.4375 65
  119.9000 58036.3984 24
  120.0000 122621.6563 53
  120.1000 80392.8203 34
  120.2000 63004.4922 27
  122.4000 128267.2188 56
  122.5000 350476.6563 155
  122.6000 378478.6250 167
  122.7000 434256.8125 192
  122.8000 477388.9688 211
  122.9000 503358.4375 223
  123.0000 577654.1875 256
  123.1000 364025.9688 161
  123.2000 357702.9375 158
  123.3000 242533.4219 107
  123.4000 191723.3750 84
  123.5000 122170.0000 53
  123.6000 58713.8594 25
  124.0000 73166.5078 31
  124.1000 86038.3984 37
  134.9000 158301.6250 69
  138.3000 114040.4141 49
  138.4000 678596.8125 301
  138.5000 643594.3125 286
  138.6000 866255.4375 385
  138.7000 1092981.3750 486
  138.8000 1198666.0000 533
  138.9000 1036299.6875 461
  139.0000 1106982.1250 492
  139.1000 955455.4375 425
  139.2000 870546.1250 387
  139.3000 665950.7500 296
  139.4000 622367.0625 276
  139.5000 249308.1094 110
  139.6000 65714.3750 28
  139.7000 52390.8398 22
  139.8000 116072.8125 50
  139.9000 101620.1563 44
  140.2000 124202.4063 54
  140.3000 71359.9219 30
  140.4000 57810.5703 24
  146.5000 71585.7422 30
  146.7000 112685.4688 49
  146.8000 82651.0625 35
  146.9000 78812.0625 34
  147.0000 57584.7500 24
  147.1000 68650.0547 29
  147.2000 53294.1289 22
  147.3000 58036.3945 24
  150.7000 55100.7031 23
  151.1000 71134.1094 30
  164.5000 191271.7031 84
  164.6000 146558.8438 64
  164.7000 160108.1875 70
  164.8000 146558.8438 64
  164.9000 141364.9375 62
  165.0000 147236.2969 64
  165.1000 190820.0625 84
  165.2000 205272.7031 90
  165.3000 198046.3906 87
  165.4000 86715.8672 37
  179.3000 53068.3047 22
  221.1000 86941.7031 37
  221.2000 207982.5625 91
  226.6000 96426.2266 42
  272.5000 139332.5469 61
  272.6000 118105.2188 51
  273.3000 68424.2500 29
  288.8000 63004.5078 27
  288.9000 86038.3906 37
  289.2000 59617.1484 25
  290.2000 75650.5547 32
  290.3000 330378.4063 146
  290.4000 1096368.6250 488
  290.5000 1441877.1250 642
  290.6000 2024273.6250 901
  290.7000 1897586.7500 845
  290.8000 1681023.1250 748
  290.9000 1829614.2500 815
  291.0000 1713541.5000 763
  291.1000 2241740.7500 999
  291.2000 1668151.2500 743
  291.3000 1373678.6250 611
  291.4000 1005813.7500 447
  291.5000 546039.0625 242
  291.6000 512165.5313 227
  291.7000 232597.2656 102
  291.8000 290182.0313 128
  291.9000 259921.7813 114
  292.0000 371026.4375 164
  292.1000 303731.3438 134
  292.2000 301247.2813 133
  292.3000 186981.0625 82
  292.4000 213402.3438 94
  292.5000 82199.4141 35
  292.8000 60520.4453 25
  292.9000 54197.4219 23
  293.2000 75198.9141 32
  331.5000 55100.7109 23
  332.0000 54649.0664 23
  578.7000 62327.0156 26
  578.8000 55552.3594 23
  578.9000 89199.9219 38
  579.1000 75650.5547 32
  580.2000 62778.6641 27
  580.3000 91006.4922 39
  580.4000 131880.3750 57
  580.5000 166431.2188 73
  580.6000 235984.6094 104
  580.7000 327668.5625 145
  580.8000 249533.9219 110
  580.9000 187432.7031 82
  581.0000 277987.6250 123
  581.1000 215886.3906 95
  581.2000 188561.8281 83
  581.3000 118331.0313 51
  581.5000 83780.1641 36
  581.6000 62327.0156 26
  581.7000 76553.8438 33
  581.8000 153333.5156 67
  581.9000 104781.6719 45
  582.0000 62778.6641 27
  582.1000 90329.0234 39
  582.2000 77005.4922 33
  597.5000 69327.5313 29
  597.6000 55326.5313 23
  597.7000 60972.0898 26
  597.8000 59391.3281 25
  598.0000 82425.2266 35
  598.1000 102975.0859 44
  598.2000 55100.7109 23
  598.8000 82876.8828 35
  599.1000 62327.0156 26
  870.4000 62778.6641 27
  870.7000 83780.1641 36
  870.8000 55778.1758 23
  870.9000 90780.6797 39
  871.0000 76779.6641 33
  871.1000 83554.3438 36
  871.2000 69327.5313 29
  871.7000 104781.6719 45