ACCESSION: MSBNK-RIKEN_NPDepo-CB000312
RECORD_TITLE: Amorphin; LC-ESI-QQQ; MS; [M+H]+
DATE: 2018.04.04
AUTHORS: Nogawa T, Okano A, CSRS, RIKEN
LICENSE: CC BY
COMMENT: Origin: Plant, Pyrans

CH$NAME: Amorphin
CH$COMPOUND_CLASS: Flavonoids
CH$FORMULA: C34H40O16
CH$EXACT_MASS: 704.6883
CH$SMILES: C=C(CO[C@@H]1O[C@@H](CO[C@@H]2OC[C@H](O)[C@H](O)[C@H]2O)[C@@H](O)[C@H](O)[C@H]1O)[C@@H]1Cc2c(ccc3c2OC2COc4cc(OC)c(OC)cc4C2C3=O)O1
CH$IUPAC: InChI=1S/C34H40O16/c1-13(9-45-34-31(41)29(39)28(38)24(50-34)12-47-33-30(40)27(37)17(35)10-46-33)19-7-16-18(48-19)5-4-14-26(36)25-15-6-21(42-2)22(43-3)8-20(15)44-11-23(25)49-32(14)16/h4-6,8,17,19,23-25,27-31,33-35,37-41H,1,7,9-12H2,2-3H3/t17-,19-,23?,24-,25?,27-,28+,29-,30+,31+,33-,34+/m0/s1
CH$LINK: CAS 4207-90-3
CH$LINK: CHEMSPIDER 109463
CH$LINK: INCHIKEY CMQOKNQYLSMKJC-ZIYIFGDVSA-N
CH$LINK: PUBCHEM CID:23010499

AC$INSTRUMENT: ABSciex API3200 LC/MS system
AC$INSTRUMENT_TYPE: LC-ESI-QQQ
AC$MASS_SPECTROMETRY: MS_TYPE MS
AC$MASS_SPECTROMETRY: ION_MODE POSITIVE

MS$FOCUSED_ION: PRECURSOR_TYPE [M+H]+

PK$SPLASH: splash10-0zfr-0100320900-ac56a8b287273deaea67
PK$NUM_PEAK: 171
PK$PEAK: m/z int. rel.int.
  101.8000 27324.5371 21
  101.9000 37260.7266 29
  102.0000 32970.0898 26
  102.1000 44938.6914 35
  102.2000 40648.0586 32
  102.3000 54649.0625 43
  121.1000 66166.0078 53
  127.2000 36131.6094 28
  134.4000 27098.7090 21
  134.5000 45841.9844 36
  134.6000 57584.7227 46
  134.7000 69553.3672 56
  135.1000 35454.1523 28
  135.4000 179303.1094 146
  135.5000 481679.4688 394
  141.5000 59391.3281 47
  141.6000 763957.6250 626
  148.4000 42228.8281 33
  149.1000 165302.1094 134
  197.7000 41777.1719 33
  198.0000 35905.7891 28
  208.8000 42906.2813 34
  220.7000 33195.9141 26
  223.0000 28453.6426 22
  225.2000 55778.1719 44
  239.0000 28679.4648 22
  247.9000 28453.6426 22
  295.4000 28227.8164 22
  410.3000 53294.1211 42
  410.4000 187658.5625 153
  410.5000 406028.9375 332
  410.6000 423191.5000 346
  410.7000 465420.2813 381
  410.8000 433353.4688 354
  410.9000 445999.5625 365
  411.0000 648336.6875 531
  411.1000 301021.4688 246
  411.2000 395189.5000 323
  411.3000 430417.7813 352
  411.4000 275277.6875 225
  411.5000 102297.6172 83
  411.6000 113362.9375 92
  411.7000 70682.4609 57
  411.8000 72714.8672 58
  411.9000 100265.2109 81
  412.0000 52165.0078 41
  412.1000 100716.8438 81
  412.2000 91683.9688 74
  412.3000 94619.6641 76
  412.6000 40422.2383 32
  412.7000 39518.9492 31
  412.8000 26872.8867 21
  413.0000 46745.2734 37
  413.2000 27324.5313 21
  542.6000 33195.9141 26
  542.7000 27550.3555 21
  542.8000 69553.3438 56
  542.9000 55326.5273 44
  543.0000 40422.2383 32
  543.3000 54423.2344 43
  544.0000 27776.1738 21
  572.4000 73618.1641 59
  572.5000 138880.8750 113
  572.6000 396318.5625 324
  572.7000 374413.8438 306
  572.8000 328797.6563 269
  572.9000 314570.8438 257
  573.0000 372155.6250 304
  573.1000 399705.9375 327
  573.2000 298763.2500 244
  573.3000 222886.8906 182
  573.4000 73618.1641 59
  573.5000 81973.5859 66
  573.6000 50810.0781 40
  573.7000 122395.8281 99
  573.8000 129396.3281 105
  573.9000 114717.8594 93
  574.0000 99361.9219 80
  574.1000 79263.7188 64
  574.2000 130525.4453 106
  574.3000 95297.1328 77
  574.4000 34550.8555 27
  574.8000 27098.7070 21
  574.9000 47648.5664 38
  575.0000 55326.5273 44
  575.1000 55326.5273 44
  704.2000 61875.3828 49
  704.3000 194207.4219 158
  704.4000 583073.8125 477
  704.5000 852480.3750 699
  704.6000 948906.3750 778
  704.7000 1059559.3750 869
  704.8000 960423.3750 787
  704.9000 936937.8750 768
  705.0000 1114208.5000 914
  705.1000 1217409.3750 999
  705.2000 1053236.3750 864
  705.3000 524811.6250 430
  705.4000 458194.0625 375
  705.5000 485744.3750 397
  705.6000 473098.2813 387
  705.7000 476937.2188 390
  705.8000 477388.8750 391
  705.9000 414610.1875 339
  706.0000 365606.7500 299
  706.1000 467001.0625 382
  706.2000 333539.9063 272
  706.3000 220854.4688 180
  706.4000 145881.3750 118
  706.5000 137977.5938 112
  706.6000 236436.2344 193
  706.7000 123750.7656 100
  706.8000 101168.5000 82
  706.9000 152204.4063 124
  707.0000 110427.2344 89
  707.1000 146333.0156 119
  707.2000 117879.3906 95
  707.3000 48100.2109 38
  707.4000 34550.8555 27
  707.5000 34776.6719 27
  707.8000 35002.4961 27
  708.1000 35002.4961 27
  708.2000 27776.1738 21
  721.2000 48551.8555 38
  721.3000 47422.7422 37
  721.4000 47196.9180 37
  721.5000 39518.9492 31
  721.6000 81296.1250 65
  721.7000 95297.1328 77
  721.8000 93264.7266 75
  721.9000 64811.0703 52
  722.0000 87167.5078 70
  722.1000 67069.2969 54
  722.3000 46519.4531 37
  722.8000 39518.9492 31
  722.9000 40422.2383 32
  723.2000 34776.6719 27
  1408.1000 28001.9961 22
  1408.2000 35002.4961 27
  1408.4000 77005.4922 62
  1408.5000 35002.4961 27
  1408.6000 63004.4961 50
  1408.7000 42003.0000 33
  1408.8000 56003.9922 45
  1408.9000 42003.0000 33
  1409.0000 70004.9922 56
  1409.1000 35002.4961 27
  1409.2000 49003.4961 39
  1409.4000 70004.9922 56
  1409.5000 56003.9922 45
  1409.7000 28001.9961 22
  1409.8000 35002.4961 27
  1409.9000 34776.6719 27
  1410.0000 49003.4961 39
  1410.1000 28001.9961 22
  1410.2000 28001.9961 22
  1410.4000 28001.9961 22
  1410.7000 28001.9961 22
  1425.4000 34550.8555 27
  1425.5000 35002.4961 27
  1425.9000 56003.9922 45
  1426.0000 63004.4961 50
  1426.1000 28001.9961 22
  1426.2000 27776.1738 21
  1426.3000 35002.4961 27
  1426.6000 49003.4961 39
  1426.7000 35002.4961 27
  1426.8000 28001.9961 22
  1426.9000 28001.9961 22
  1427.0000 28001.9961 22
  1427.1000 28001.9961 22