ACCESSION: MSBNK-RIKEN_NPDepo-CB000302
RECORD_TITLE: liquiritigenin; LC-ESI-QQQ; MS; [M+H]+
DATE: 2018.04.04
AUTHORS: Nogawa T, Okano A, CSRS, RIKEN
LICENSE: CC BY
COMMENT: Origin: Plant
COMMENT: Formula(Parent): C15H12O4
COMMENT: Bottle Name:Liquiritigenin
COMMENT: PRIME Parent Name:4',7-Dihydroxyflavanone
COMMENT: PRIME in-house No.:T0084, Pyrans

CH$NAME: Liquiritigenin
CH$NAME: (2S)-7-hydroxy-2-(4-hydroxyphenyl)-2,3-dihydrochromen-4-one
CH$NAME: liquiritigenin
CH$COMPOUND_CLASS: Flavonoids
CH$FORMULA: C15H12O4
CH$EXACT_MASS: 256.2605
CH$SMILES: O=C1C[C@@H](c2ccc(O)cc2)Oc2cc(O)ccc21
CH$IUPAC: InChI=1S/C15H12O4/c16-10-3-1-9(2-4-10)14-8-13(18)12-6-5-11(17)7-15(12)19-14/h1-7,14,16-17H,8H2/t14-/m0/s1
CH$LINK: CAS 578-86-9
CH$LINK: CHEMSPIDER 102790
CH$LINK: INCHIKEY FURUXTVZLHCCNA-AWEZNQCLSA-N
CH$LINK: COMPTOX DTXSID90206493
CH$LINK: PUBCHEM CID:114829

AC$INSTRUMENT: ABSciex API3200 LC/MS system
AC$INSTRUMENT_TYPE: LC-ESI-QQQ
AC$MASS_SPECTROMETRY: MS_TYPE MS
AC$MASS_SPECTROMETRY: ION_MODE POSITIVE

MS$FOCUSED_ION: PRECURSOR_TYPE [M+H]+

PK$SPLASH: splash10-0a4i-0290000000-08d1855f72f5938ba3c8
PK$NUM_PEAK: 84
PK$PEAK: m/z int. rel.int.
  100.2000 186149.6719 27
  118.6000 154011.0000 22
  118.8000 217651.9375 32
  119.0000 168966.6250 24
  119.1000 150828.9688 22
  119.2000 186467.8750 27
  136.4000 634818.1250 96
  136.5000 772282.5000 117
  136.6000 873789.6875 132
  136.7000 1282682.5000 195
  136.8000 1275363.8750 194
  136.9000 1332959.0000 203
  137.0000 2414536.0000 369
  137.1000 1501925.7500 229
  137.2000 927248.0625 141
  137.3000 877289.9375 133
  137.4000 897973.3125 136
  137.5000 217333.7188 32
  137.7000 161329.7344 23
  137.9000 182649.3906 27
  138.0000 261882.3594 39
  146.3000 160693.3281 23
  146.4000 208423.9688 30
  146.5000 466169.6563 70
  146.6000 448986.6250 67
  146.7000 657092.3750 99
  146.8000 528219.5625 79
  146.9000 483989.1563 73
  147.0000 500535.7188 75
  147.1000 449623.0625 67
  147.2000 488125.8438 73
  147.3000 522491.9063 79
  147.4000 401892.4063 60
  162.7000 392346.2500 59
  210.6000 145737.6719 21
  210.8000 168330.2188 24
  211.1000 270473.9063 40
  211.2000 160375.1250 23
  211.4000 160056.9219 23
  220.5000 241835.5000 36
  238.4000 211924.2500 31
  238.5000 348115.8125 52
  238.6000 327114.3438 49
  238.7000 381209.0313 57
  238.8000 391709.8438 59
  238.9000 391391.6563 59
  239.0000 413347.7500 62
  239.1000 299748.6875 44
  239.2000 291793.5313 43
  239.3000 225925.2188 33
  241.7000 161966.1250 23
  241.9000 169603.0000 25
  242.0000 170875.8594 25
  242.1000 206832.9688 30
  256.3000 724551.8125 110
  256.4000 2874341.7500 439
  256.5000 4562416.5000 698
  256.6000 5136776.5000 786
  256.7000 5074089.5000 777
  256.8000 4842436.0000 741
  256.9000 4191073.0000 641
  257.0000 4662016.0000 713
  257.1000 4437043.5000 679
  257.2000 4783250.5000 732
  257.3000 6521602.0000 999
  257.4000 3715674.2500 568
  257.5000 1642253.6250 250
  257.6000 2108741.2500 322
  257.7000 1949002.8750 297
  257.8000 1044983.9375 159
  257.9000 1107033.6250 168
  258.0000 1314503.0000 200
  258.1000 1039892.5625 158
  258.2000 956523.0000 145
  258.3000 956522.8125 145
  258.4000 937112.3750 142
  258.5000 384391.1250 57
  258.6000 300385.0625 45
  258.7000 173421.4688 25
  258.8000 217651.9063 32
  258.9000 213197.0469 31
  259.0000 207787.5938 30
  259.1000 212242.4375 31
  259.2000 160693.3281 23