ACCESSION: MSBNK-RIKEN_NPDepo-CB000274
RECORD_TITLE: Kanamycin; LC-ESI-QQQ; MS; [M+H]+
DATE: 2018.04.04
AUTHORS: Nogawa T, Okano A, CSRS, RIKEN
LICENSE: CC BY
COMMENT: Origin: Microbe, Glycosides, Aminoglycosides

CH$NAME: Kanamycin
CH$COMPOUND_CLASS: Carbohydrates
CH$FORMULA: C18H36N4O11
CH$EXACT_MASS: 484.5078
CH$SMILES: NC[C@@H]1O[C@@H](O[C@@H]2[C@@H](N)C[C@@H](N)[C@H](O[C@@H]3O[C@@H](CO)[C@H](O)[C@@H](N)[C@@H]3O)[C@H]2O)[C@@H](O)[C@H](O)[C@H]1O
CH$IUPAC: InChI=1S/C18H36N4O11/c19-2-6-10(25)12(27)13(28)18(30-6)33-16-5(21)1-4(20)15(14(16)29)32-17-11(26)8(22)9(24)7(3-23)31-17/h4-18,23-29H,1-3,19-22H2/t4-,5+,6+,7+,8-,9+,10+,11+,12-,13+,14-,15+,16-,17+,18+/m1/s1
CH$LINK: CAS 8063-07-8
CH$LINK: CHEMSPIDER 5810
CH$LINK: INCHIKEY SBUJHOSQTJFQJX-HZKXJDKASA-N
CH$LINK: PUBCHEM CID:16397788

AC$INSTRUMENT: ABSciex API3200 LC/MS system
AC$INSTRUMENT_TYPE: LC-ESI-QQQ
AC$MASS_SPECTROMETRY: MS_TYPE MS
AC$MASS_SPECTROMETRY: ION_MODE POSITIVE

MS$FOCUSED_ION: PRECURSOR_TYPE [M+H]+

PK$SPLASH: splash10-03di-0942000000-6de6702236244bbc69e0
PK$NUM_PEAK: 317
PK$PEAK: m/z int. rel.int.
  100.1000 55552.3750 63
  101.8000 45616.1680 51
  101.9000 28905.2930 32
  102.0000 63230.3281 72
  102.1000 53519.9492 61
  102.2000 39518.9336 44
  102.3000 25743.7754 28
  102.4000 53971.5977 61
  106.5000 24163.0059 27
  109.1000 21001.4902 23
  109.2000 22582.2500 25
  109.5000 25517.9531 28
  109.6000 25517.9531 28
  109.7000 99361.9375 114
  109.9000 42454.6445 48
  110.0000 36131.6172 40
  110.1000 39293.1289 44
  110.3000 44938.6914 51
  110.5000 53294.1133 60
  113.1000 19646.5566 21
  113.5000 21678.9805 24
  113.6000 30937.6914 34
  113.9000 42906.2891 48
  114.2000 31840.9863 35
  114.4000 21678.9648 24
  114.5000 31163.5195 35
  114.6000 21001.5039 23
  114.7000 56907.2891 65
  115.0000 41551.3438 47
  115.1000 23937.1973 26
  115.4000 76553.8438 87
  115.9000 40648.0586 46
  116.0000 46067.8008 52
  116.1000 25969.5938 29
  116.2000 26195.4121 29
  118.2000 19872.3926 22
  119.6000 21678.9688 24
  119.9000 79263.7188 91
  120.0000 21453.1484 23
  120.1000 19420.7344 21
  120.2000 41551.3594 47
  125.6000 21453.1543 23
  125.7000 67069.3125 76
  125.8000 51713.3750 59
  125.9000 25969.5996 29
  126.0000 59165.5195 67
  126.2000 35002.5039 39
  126.3000 33873.3906 38
  126.5000 22130.6211 24
  126.8000 26421.2441 29
  126.9000 32744.2734 37
  127.0000 22808.0840 25
  128.1000 86490.0547 99
  128.2000 32292.6309 36
  128.8000 20549.8574 22
  129.8000 23937.1855 26
  134.6000 30034.4199 33
  136.0000 45164.5039 51
  136.5000 42454.6484 48
  136.6000 93490.5625 107
  136.7000 45616.1563 51
  141.2000 23937.1914 26
  143.5000 73618.1641 84
  143.6000 117201.9297 135
  143.7000 132783.6875 153
  143.8000 143397.3438 165
  143.9000 105233.3125 121
  144.0000 88522.4531 101
  144.1000 70004.9922 80
  144.2000 82876.8906 95
  144.3000 109298.1250 125
  144.4000 86715.8594 99
  144.5000 48100.2109 54
  144.7000 67069.2891 76
  144.8000 25969.5938 29
  145.2000 51487.5508 58
  145.3000 28679.4668 32
  148.5000 83554.3516 96
  148.6000 41325.5273 47
  148.8000 53971.6055 61
  148.9000 39744.7578 45
  149.1000 64359.4219 73
  149.3000 32292.6406 36
  149.4000 20098.2109 22
  149.5000 49229.3203 56
  149.6000 60972.1016 69
  153.7000 39518.9492 44
  160.1000 24163.0137 27
  161.4000 33647.5664 38
  161.5000 84231.8203 96
  161.6000 128493.0469 148
  161.7000 309602.7188 358
  161.8000 318184.0000 368
  161.9000 482357.0313 559
  162.0000 500422.7500 580
  162.1000 601365.5625 697
  162.2000 697565.9375 809
  162.3000 591880.9375 686
  162.4000 707727.8750 821
  162.5000 481453.7188 558
  162.6000 462484.6250 536
  162.7000 498164.6250 577
  162.8000 416191.0000 482
  162.9000 280471.6250 324
  163.0000 286794.6563 332
  163.1000 205950.1875 238
  163.2000 272116.1875 315
  163.3000 660531.1250 766
  163.4000 162592.2656 187
  163.5000 127138.1172 146
  163.6000 123299.1172 142
  163.7000 21678.9668 24
  164.1000 21227.3223 23
  173.2000 21904.7832 24
  173.4000 30486.0449 34
  175.5000 28453.6484 32
  175.6000 72714.8750 83
  175.7000 29356.9395 33
  175.8000 50358.4258 57
  175.9000 57810.5820 66
  176.0000 44261.2227 50
  176.1000 64359.4375 73
  176.2000 56907.2891 65
  176.3000 55100.6953 63
  176.4000 57358.9375 65
  176.5000 38389.8438 43
  176.6000 157398.3281 181
  180.3000 23485.5488 26
  186.5000 19194.9121 21
  186.6000 32292.6270 36
  186.7000 40196.4219 45
  186.8000 19872.3789 22
  186.9000 19194.9219 21
  187.0000 42454.6484 48
  187.1000 63681.9688 72
  187.2000 38389.8398 43
  187.4000 20775.6758 23
  188.8000 21678.9668 24
  189.4000 36357.4375 41
  189.6000 33873.3867 38
  190.1000 27550.3457 31
  190.2000 20098.2090 22
  190.3000 59617.1563 68
  197.8000 20324.0176 22
  198.3000 21001.4902 23
  203.2000 21678.9668 24
  203.6000 30486.0410 34
  204.5000 35454.1445 40
  204.6000 53519.9453 61
  204.7000 62778.6602 71
  204.8000 61875.3711 70
  204.9000 73843.9844 84
  205.0000 53745.7656 61
  205.1000 55778.1680 63
  205.2000 50584.2578 57
  205.3000 46971.0977 53
  205.4000 34099.2070 38
  205.5000 44487.0508 50
  205.6000 23711.3711 26
  206.7000 27776.1543 31
  206.8000 36583.2578 41
  207.4000 42680.4648 48
  208.5000 23259.7266 26
  213.6000 28227.8223 31
  216.7000 35905.7969 40
  216.8000 83102.7031 95
  216.9000 38389.8359 43
  217.2000 35002.5000 39
  220.6000 48551.8438 55
  220.7000 105684.9688 121
  220.8000 95297.1641 109
  220.9000 130299.6094 150
  221.0000 133461.1719 154
  221.1000 100716.8672 115
  221.2000 82425.2188 94
  221.4000 24388.8555 27
  221.5000 54649.0625 62
  221.6000 58262.2266 66
  221.7000 64133.6055 73
  221.9000 29131.1133 32
  222.0000 56004.0078 64
  222.6000 49906.7891 56
  222.8000 31840.9570 35
  223.1000 26195.4219 29
  223.3000 21453.1250 23
  223.4000 31840.9688 35
  224.2000 23485.5410 26
  224.3000 24840.4863 27
  224.4000 26195.4023 29
  224.6000 27098.7070 30
  224.7000 37034.8984 42
  224.8000 39518.9531 44
  224.9000 31840.9844 35
  225.1000 27776.1699 31
  225.3000 87844.9453 101
  225.4000 152204.4219 175
  225.9000 18969.0859 21
  227.2000 19646.5684 21
  227.3000 32744.2754 37
  238.6000 63230.3438 72
  238.7000 26421.2168 29
  238.8000 20098.2285 22
  238.9000 26421.2500 29
  239.0000 53971.6250 61
  239.4000 25517.9531 28
  239.9000 40873.8828 46
  241.3000 27324.5313 30
  242.4000 41777.1758 47
  242.5000 181335.5156 209
  242.6000 192852.4688 223
  242.7000 267825.5938 310
  242.8000 445322.0938 516
  242.9000 255856.9844 296
  243.0000 288375.4063 333
  243.1000 309376.9063 358
  243.2000 235081.3125 272
  243.3000 283181.5313 327
  243.4000 217918.7813 252
  243.5000 150397.8281 173
  243.6000 110427.2344 127
  243.7000 111556.3359 128
  243.8000 115169.5000 132
  243.9000 68875.8906 79
  244.0000 29582.7480 33
  244.1000 30711.8633 34
  244.2000 37034.8984 42
  256.9000 28001.9922 31
  257.2000 25066.3066 28
  257.3000 24163.0137 27
  262.6000 23937.1914 26
  263.1000 35002.4961 39
  263.7000 30711.8633 34
  264.5000 25743.7734 28
  266.6000 23485.5488 26
  278.2000 25743.7734 28
  281.1000 19646.5645 21
  284.9000 26647.0566 29
  285.4000 24163.0137 27
  285.9000 25743.7734 28
  290.9000 24614.6621 27
  292.0000 19194.9199 21
  294.4000 21678.9590 24
  294.5000 40196.4023 45
  294.8000 20549.8359 22
  295.2000 31615.1484 35
  295.4000 19646.5723 21
  295.6000 23259.7266 26
  295.9000 19194.9141 21
  296.1000 21453.1387 23
  296.3000 36131.6133 40
  298.3000 32066.7988 36
  299.1000 20098.2109 22
  310.3000 20324.0313 22
  310.7000 104330.0391 120
  310.8000 860835.6875 999
  310.9000 300118.2188 347
  312.5000 23259.7266 26
  312.6000 41325.5352 47
  312.8000 68198.4141 78
  312.9000 58713.8750 67
  313.1000 39744.7656 45
  323.5000 71359.9375 81
  323.6000 113814.5703 131
  323.7000 99361.9375 114
  323.8000 71359.9375 81
  323.9000 171850.9844 198
  324.0000 527521.5625 611
  324.1000 163495.5313 188
  324.2000 85360.9375 98
  324.3000 93490.5391 107
  324.4000 87393.3359 100
  324.5000 55326.5234 63
  324.6000 21904.7910 24
  324.7000 23033.9004 25
  324.9000 28679.4590 32
  325.2000 24388.8379 27
  325.3000 23485.5488 26
  325.4000 24840.4844 27
  325.7000 19872.3848 22
  328.0000 19420.7422 21
  354.5000 35454.1445 40
  365.4000 20098.2090 22
  365.8000 19646.5645 21
  371.1000 19420.7344 21
  371.8000 22130.6113 24
  372.7000 29582.7520 33
  372.8000 21904.7910 24
  390.7000 24840.4766 27
  391.2000 23937.1855 26
  393.1000 18969.0977 21
  416.9000 19872.3848 22
  432.7000 18969.0859 21
  433.1000 34325.0391 38
  433.5000 28227.8164 31
  437.7000 34099.1992 38
  448.0000 20098.2090 22
  484.6000 72037.4063 82
  484.7000 113588.7500 130
  484.8000 101620.1563 117
  484.9000 86038.4063 98
  485.0000 112685.4609 129
  485.1000 93716.3750 107
  485.2000 104104.2109 119
  485.3000 101620.1563 117
  485.4000 72940.6953 83
  485.5000 54197.4180 61
  485.6000 60972.0898 69
  485.7000 93942.1953 108
  485.8000 53068.3047 60
  485.9000 23485.5488 26
  486.1000 25743.7734 28
  486.3000 44261.2227 50
  486.4000 28679.4590 32
  486.7000 41777.1719 47
  486.8000 27098.7090 30
  487.1000 56003.9922 64
  513.2000 20549.8555 22