ACCESSION: MSBNK-RIKEN_NPDepo-CB000212
RECORD_TITLE: Cyclosporin A; LC-ESI-QQQ; MS; [M+H]+
DATE: 2018.04.04
AUTHORS: Nogawa T, Okano A, CSRS, RIKEN
LICENSE: CC BY
COMMENT: Origin: Microbe
COMMENT: SubCategory_DNP: Peptides, Cyclic peptides, Cyclosporins

CH$NAME: Cyclosporin A
CH$COMPOUND_CLASS: Aminoacids and peptides
CH$FORMULA: C62H111N11O12
CH$EXACT_MASS: 1202.6425
CH$SMILES: C/C=C/C[C@@H](C)[C@@H](O)C1C(O)=NC(CC)C(=O)N(C)CC(=O)N(C)C(CC(C)C)C(O)=NC(C(C)C)C(=O)N(C)C(CC(C)C)C(O)=NC(C)C(O)=N[C@H](C)C(=O)N(C)C(CC(C)C)C(=O)N(C)C(CC(C)C)C(=O)N(C)C(C(C)C)C(=O)N1C
CH$IUPAC: InChI=1S/C62H111N11O12/c1-25-27-28-40(15)52(75)51-56(79)65-43(26-2)58(81)67(18)33-48(74)68(19)44(29-34(3)4)55(78)66-49(38(11)12)61(84)69(20)45(30-35(5)6)54(77)63-41(16)53(76)64-42(17)57(80)70(21)46(31-36(7)8)59(82)71(22)47(32-37(9)10)60(83)72(23)50(39(13)14)62(85)73(51)24/h25,27,34-47,49-52,75H,26,28-33H2,1-24H3,(H,63,77)(H,64,76)(H,65,79)(H,66,78)/b27-25+/t40-,41?,42-,43?,44?,45?,46?,47?,49?,50?,51?,52-/m1/s1
CH$LINK: CAS 59865-13-3
CH$LINK: CHEMSPIDER 21864739
CH$LINK: INCHIKEY PMATZTZNYRCHOR-NFOUMSERSA-N
CH$LINK: PUBCHEM CID:16404350

AC$INSTRUMENT: ABSciex API3200 LC/MS system
AC$INSTRUMENT_TYPE: LC-ESI-QQQ
AC$MASS_SPECTROMETRY: MS_TYPE MS
AC$MASS_SPECTROMETRY: ION_MODE POSITIVE

MS$FOCUSED_ION: PRECURSOR_TYPE [M+H]+

PK$SPLASH: splash10-0udi-0090001000-de0815476cd989c31f3c
PK$NUM_PEAK: 99
PK$PEAK: m/z int. rel.int.
  148.4000 77390.1484 26
  165.9000 82852.0703 28
  270.2000 74466.8672 25
  397.1000 61542.8555 21
  509.8000 61850.5703 21
  510.0000 61235.1484 21
  510.1000 68158.7188 23
  510.2000 125085.8672 44
  510.3000 75851.5781 26
  545.7000 62389.0703 21
  601.2000 81928.9375 28
  601.3000 109238.5703 38
  601.4000 235170.6563 83
  601.5000 193090.7188 68
  601.6000 242248.0781 86
  601.7000 254941.3125 90
  601.8000 311560.7188 111
  601.9000 330715.9375 118
  602.0000 239555.5625 85
  602.1000 184936.2969 65
  602.2000 228093.2500 81
  602.3000 220400.3750 78
  602.4000 200322.0000 71
  602.5000 171704.5938 60
  602.6000 110392.5000 38
  602.7000 67851.0078 23
  602.8000 82390.5078 28
  1189.9000 104392.0703 36
  1201.5000 76313.1484 26
  1201.6000 292251.6563 104
  1201.7000 417491.3438 149
  1201.8000 457186.5625 163
  1201.9000 478188.0000 171
  1202.0000 665509.0625 239
  1202.1000 755900.2500 271
  1202.2000 720589.9375 258
  1202.3000 811134.9375 291
  1202.4000 929451.0625 334
  1202.5000 755361.7500 271
  1202.6000 796441.5625 286
  1202.7000 845060.3750 303
  1202.8000 505189.9063 181
  1202.9000 486111.6250 174
  1203.0000 505728.3750 181
  1203.1000 1621961.8750 584
  1203.2000 2772428.7500 999
  1203.3000 980608.5625 352
  1203.4000 861907.7500 309
  1203.5000 624890.8125 224
  1203.6000 477495.6563 171
  1203.7000 427415.1875 153
  1203.8000 310022.1250 110
  1203.9000 207322.5000 73
  1204.0000 170858.3594 60
  1204.1000 158242.0625 56
  1204.2000 164473.2813 58
  1204.3000 200091.2031 71
  1204.4000 220785.0000 78
  1204.5000 219938.7969 78
  1204.6000 164857.9375 58
  1204.7000 150780.0156 53
  1204.8000 67774.0781 23
  1204.9000 96776.1328 33
  1205.1000 75851.5781 26
  1205.2000 68466.4375 23
  1205.3000 61004.3594 21
  1205.4000 75543.8672 26
  1205.5000 61542.8555 21
  1205.6000 89775.6484 31
  1218.7000 74236.0781 25
  1218.8000 151549.2813 53
  1218.9000 172396.9375 61
  1219.0000 213246.0156 75
  1219.1000 213630.6563 76
  1219.2000 324792.4688 116
  1219.3000 270557.7813 96
  1219.4000 290251.4688 103
  1219.5000 248710.0781 88
  1219.6000 219477.2344 78
  1219.7000 248787.0156 88
  1219.8000 193167.6094 68
  1219.9000 151395.4375 53
  1220.0000 137471.3594 48
  1220.1000 180397.5000 64
  1220.2000 172396.9375 61
  1220.3000 144779.5781 51
  1220.4000 158934.4219 56
  1220.5000 242248.0781 86
  1220.6000 130778.5859 46
  1220.7000 143779.5000 50
  1220.8000 180243.6563 64
  1220.9000 97237.7031 34
  1221.0000 103853.5703 36
  1221.1000 61158.2188 21
  1221.3000 61542.8555 21
  1221.4000 75697.7188 26
  1221.5000 96083.7734 33
  1221.7000 68543.3672 23
  1221.8000 61542.8555 21