ACCESSION: MSBNK-RIKEN_NPDepo-CB000202
RECORD_TITLE: 6-Benzoylheteratisine; LC-ESI-QQQ; MS; [M+H]+
DATE: 2018.04.04
AUTHORS: Nogawa T, Okano A, CSRS, RIKEN
LICENSE: CC BY
COMMENT: Origin: Plant
COMMENT: SubCategory_DNP: Terpenoid alkaloids, Diterpene alkaloid, Aconitum alkaloid

CH$NAME: 6-Benzoylheteratisine
CH$COMPOUND_CLASS: Alkaloids
CH$FORMULA: C29H37NO6
CH$EXACT_MASS: 495.6213
CH$SMILES: CCN1C[C@]2(C)CC[C@H](OC)[C@]34C5C[C@@H]6CC[C@@](O)(C5C(=O)O6)[C@H](C13)[C@@H](OC(=O)c1ccccc1)C42
CH$IUPAC: InChI=1S/C29H37NO6/c1-4-30-15-27(2)12-11-19(34-3)29-18-14-17-10-13-28(33,20(18)26(32)35-17)21(24(29)30)22(23(27)29)36-25(31)16-8-6-5-7-9-16/h5-9,17-24,33H,4,10-15H2,1-3H3/t17-,18?,19-,20?,21-,22+,23?,24?,27-,28+,29-/m0/s1
CH$LINK: CAS 99759-48-5
CH$LINK: CHEMSPIDER 4589194
CH$LINK: INCHIKEY XVVZJDDPRFFKTQ-MFJRHRAESA-N

AC$INSTRUMENT: ABSciex API3200 LC/MS system
AC$INSTRUMENT_TYPE: LC-ESI-QQQ
AC$MASS_SPECTROMETRY: MS_TYPE MS
AC$MASS_SPECTROMETRY: ION_MODE POSITIVE

MS$FOCUSED_ION: PRECURSOR_TYPE [M+H]+

PK$SPLASH: splash10-0002-0000900000-fd598a0919258e482a20
PK$NUM_PEAK: 61
PK$PEAK: m/z int. rel.int.
  141.8000 408452.2500 37
  341.6000 326510.5000 30
  341.7000 423664.8438 39
  341.8000 437127.3125 40
  341.9000 485592.3750 45
  342.0000 496631.6250 46
  342.1000 492413.3438 45
  342.2000 455840.2188 42
  342.3000 408631.6875 37
  342.4000 343338.6563 31
  463.6000 246902.2344 22
  463.7000 341768.0000 31
  463.8000 360301.3750 33
  463.9000 316368.7188 29
  464.0000 399881.1250 36
  464.1000 352268.7813 32
  464.2000 445698.5000 41
  464.3000 300976.5938 27
  464.4000 288187.2500 26
  495.3000 257717.1406 23
  495.4000 1881025.1250 177
  495.5000 5554224.0000 526
  495.6000 8203284.0000 777
  495.7000 9276560.0000 879
  495.8000 10121108.0000 959
  495.9000 10144665.0000 962
  496.0000 10260489.0000 973
  496.1000 10531938.0000 999
  496.2000 9993707.0000 947
  496.3000 9788045.0000 928
  496.4000 9750484.0000 924
  496.5000 5747141.5000 544
  496.6000 4669468.0000 442
  496.7000 5489961.5000 520
  496.8000 7021546.0000 665
  496.9000 6602862.5000 625
  497.0000 6233227.5000 590
  497.1000 6308033.5000 597
  497.2000 6106993.0000 578
  497.3000 5608612.5000 531
  497.4000 5871445.0000 556
  497.5000 3063571.2500 289
  497.6000 2085969.3750 197
  497.7000 2168135.7500 204
  497.8000 2283643.7500 215
  497.9000 2383894.7500 225
  498.0000 2360470.0000 223
  498.1000 2499134.0000 236
  498.2000 2565593.5000 242
  498.3000 2275387.0000 215
  498.4000 2126536.5000 200
  498.5000 1064345.2500 100
  498.6000 582926.2500 54
  498.7000 500849.8125 46
  498.8000 506055.3438 47
  498.9000 514491.8750 47
  499.0000 506100.2813 47
  499.1000 503811.5938 46
  499.2000 695786.8750 65
  499.3000 582746.8125 54
  499.4000 347556.9063 32