ACCESSION: MSBNK-RIKEN_NPDepo-CB000196
RECORD_TITLE: Flaconitine; LC-ESI-QQQ; MS; [M+H]+
DATE: 2018.04.04
AUTHORS: Nogawa T, Okano A, CSRS, RIKEN
LICENSE: CC BY
COMMENT: Origin: Plant
COMMENT: SubCategory_DNP: Terpenoid alkaloids, Diterpene alkaloid, Aconitum alkaloid

CH$NAME: Flaconitine
CH$COMPOUND_CLASS: Alkaloids
CH$FORMULA: C36H49NO12
CH$EXACT_MASS: 687.7914
CH$SMILES: CCN1C[C@@]2(COC)C3[C@@H](OC)[C@H]4C1[C@@]3(C1C[C@]3(O)[C@@H](OC)[C@H](O)[C@@]4(OC(C)=O)C1[C@H]3OC(=O)c1ccccc1)[C@@H](OC)C[C@H]2OC(C)=O
CH$IUPAC: InChI=1S/C36H49NO12/c1-8-37-16-33(17-43-4)22(47-18(2)38)14-23(44-5)35-21-15-34(42)30(48-32(41)20-12-10-9-11-13-20)24(21)36(49-19(3)39,29(40)31(34)46-7)25(28(35)37)26(45-6)27(33)35/h9-13,21-31,40,42H,8,14-17H2,1-7H3/t21?,22-,23+,24?,25+,26+,27?,28?,29+,30-,31+,33+,34-,35+,36-/m1/s1
CH$LINK: CAS 77181-26-1
CH$LINK: CHEMSPIDER 48391 10226901
CH$LINK: INCHIKEY RIPYIJVYDYCPKW-YGLHNUDVSA-N

AC$INSTRUMENT: ABSciex API3200 LC/MS system
AC$INSTRUMENT_TYPE: LC-ESI-QQQ
AC$MASS_SPECTROMETRY: MS_TYPE MS
AC$MASS_SPECTROMETRY: ION_MODE POSITIVE

MS$FOCUSED_ION: PRECURSOR_TYPE [M+H]+

PK$SPLASH: splash10-000i-0100009000-047d1c6d2f537d380f46
PK$NUM_PEAK: 68
PK$PEAK: m/z int. rel.int.
  100.4000 289010.9063 104
  100.5000 486946.5625 177
  100.6000 532724.3750 194
  100.7000 633750.9375 231
  100.8000 743563.0000 271
  100.9000 802449.4375 293
  101.0000 862708.6250 315
  101.1000 835873.4375 305
  101.2000 712266.4375 259
  101.3000 671155.8125 244
  101.4000 495868.7500 180
  101.5000 163207.7188 58
  627.6000 72407.1250 25
  627.7000 105144.7734 37
  627.8000 98075.6328 34
  627.9000 129989.6719 46
  628.0000 143235.7188 51
  628.1000 117635.8438 42
  628.2000 114204.2266 40
  628.3000 138362.8281 49
  628.4000 75152.4375 26
  671.8000 73162.0938 25
  671.9000 70622.6719 24
  672.0000 61769.1211 21
  672.1000 86270.8594 30
  672.2000 68632.3594 24
  672.3000 66710.6484 23
  687.3000 154354.1719 55
  687.4000 501016.1875 182
  687.5000 1059066.0000 387
  687.6000 2034468.8750 744
  687.7000 2415996.0000 884
  687.8000 2517983.7500 921
  687.9000 2701369.7500 988
  688.0000 2632188.0000 963
  688.1000 2557035.5000 935
  688.2000 2729234.2500 999
  688.3000 2271319.2500 831
  688.4000 1675795.8750 613
  688.5000 923311.1250 337
  688.6000 1015896.1875 371
  688.7000 1140120.6250 416
  688.8000 1324673.0000 484
  688.9000 1538943.2500 562
  689.0000 1546904.6250 565
  689.1000 1248902.8750 456
  689.2000 1180751.1250 431
  689.3000 1029691.1250 376
  689.4000 782614.6875 285
  689.5000 383174.4063 139
  689.6000 352701.6563 128
  689.7000 388733.6875 141
  689.8000 422981.1875 153
  689.9000 407264.3750 148
  690.0000 380703.6563 138
  690.1000 368692.9375 134
  690.2000 352838.9375 128
  690.3000 286402.8438 103
  690.4000 237399.2969 85
  690.5000 81535.2344 28
  690.6000 93545.8906 33
  690.7000 91349.6641 32
  690.8000 86819.9375 30
  690.9000 103154.4219 36
  691.0000 83456.9453 29
  691.1000 71652.1797 25
  691.2000 63210.3984 22
  691.3000 72681.6641 25