ACCESSION: MSBNK-RIKEN_NPDepo-CB000137
RECORD_TITLE: evodiamine; LC-ESI-QQQ; MS; [M+H]+
DATE: 2018.04.04
AUTHORS: Nogawa T, Okano A, CSRS, RIKEN
LICENSE: CC BY
COMMENT: Origin: Plant
COMMENT: Formula(Parent): C19H17N3O
COMMENT: Bottle Name:Evodiamine
COMMENT: PRIME Parent Name:Evodiamine
COMMENT: PRIME in-house No.:V0296
COMMENT: SubCategory_DNP: Monoterpenoid indole alkaloids, Indoloquinolizidine alkaloids, Indole alkaloids

CH$NAME: evodiamine
CH$COMPOUND_CLASS: Alkaloids
CH$FORMULA: C19H17N3O
CH$EXACT_MASS: 303.3668
CH$SMILES: CN1c2ccccc2C(=O)N2CCc3c([nH]c4ccccc34)[C@H]21
CH$IUPAC: InChI=1S/C19H17N3O/c1-21-16-9-5-3-7-14(16)19(23)22-11-10-13-12-6-2-4-8-15(12)20-17(13)18(21)22/h2-9,18,20H,10-11H2,1H3/t18-/m0/s1
CH$LINK: CAS 518-17-2
CH$LINK: CHEMSPIDER 133343 390624
CH$LINK: INCHIKEY TXDUTHBFYKGSAH-SFHVURJKSA-N
CH$LINK: COMPTOX DTXSID10966123
CH$LINK: PUBCHEM CID:442088

AC$INSTRUMENT: ABSciex API3200 LC/MS system
AC$INSTRUMENT_TYPE: LC-ESI-QQQ
AC$MASS_SPECTROMETRY: MS_TYPE MS
AC$MASS_SPECTROMETRY: ION_MODE POSITIVE

MS$FOCUSED_ION: PRECURSOR_TYPE [M+H]+

PK$SPLASH: splash10-0udi-0609000000-c7ebdf5605b530692b41
PK$NUM_PEAK: 142
PK$PEAK: m/z int. rel.int.
  105.6000 209802.8438 22
  105.7000 229743.7188 24
  105.8000 208954.2969 21
  105.9000 207257.2188 21
  106.0000 254775.7500 26
  106.3000 220197.5469 23
  106.4000 248835.9531 26
  115.5000 207893.6406 21
  115.6000 274928.7188 29
  115.7000 381845.4063 40
  115.8000 366147.4063 39
  115.9000 633863.4375 68
  116.0000 1090805.2500 118
  116.1000 468184.9063 50
  116.2000 342600.2500 36
  116.3000 226137.3750 23
  116.4000 265170.5000 28
  117.6000 244593.2188 25
  117.7000 382906.0938 40
  117.8000 257533.5625 27
  117.9000 291475.4063 30
  118.0000 437849.4688 47
  133.4000 2177792.2500 237
  133.5000 4663818.5000 510
  133.6000 4649181.0000 508
  133.7000 4775189.5000 522
  133.8000 5066665.0000 554
  133.9000 5779231.5000 632
  134.0000 5533154.0000 605
  134.1000 5081514.5000 556
  134.2000 4783038.5000 523
  134.3000 3975859.5000 434
  134.4000 3624986.2500 396
  134.5000 1727850.8750 188
  134.6000 758599.6875 82
  134.7000 773873.5000 83
  134.8000 806754.5625 87
  134.9000 666744.6250 72
  135.0000 577223.1250 62
  135.1000 506157.4375 54
  135.2000 487277.3125 52
  135.3000 377390.6563 40
  135.4000 431061.0938 46
  143.4000 332841.9063 35
  143.5000 753296.3125 81
  143.6000 940188.4375 102
  143.7000 997465.3125 108
  143.8000 1315669.6250 143
  143.9000 1102897.0000 119
  144.0000 1066197.2500 115
  144.1000 1261575.1250 137
  144.2000 773237.1250 83
  144.3000 692837.5000 74
  144.4000 525886.0625 56
  144.5000 256048.6250 27
  160.4000 803360.5625 87
  160.5000 1360218.3750 148
  160.6000 1381219.7500 150
  160.7000 1265393.3750 137
  160.8000 1144900.1250 124
  160.9000 1191994.1250 129
  161.0000 1220844.7500 132
  161.1000 1025891.5625 111
  161.2000 1146597.0000 124
  161.3000 959705.0625 104
  161.4000 1284910.0000 139
  161.5000 722536.5000 78
  170.4000 899882.3125 97
  170.5000 1642783.8750 179
  170.6000 2135152.5000 233
  170.7000 2516149.5000 274
  170.8000 2835414.5000 309
  170.9000 2599519.5000 284
  171.0000 2554758.5000 279
  171.1000 2110968.7500 230
  171.2000 2608004.7500 284
  171.3000 2093786.0000 228
  171.4000 1873588.5000 204
  171.5000 799966.3125 86
  171.6000 441243.5938 47
  171.7000 397967.8750 42
  171.8000 383754.6250 41
  171.9000 473488.4375 50
  172.0000 766448.7500 83
  172.1000 341963.8438 36
  172.2000 378663.4688 40
  172.3000 381633.3438 40
  172.4000 305476.3750 32
  301.4000 789147.1875 85
  301.5000 1549443.8750 168
  301.6000 1758186.1250 191
  301.7000 2224886.5000 242
  301.8000 2322681.2500 253
  301.9000 2417505.7500 264
  302.0000 2263283.2500 247
  302.1000 2805079.0000 306
  302.2000 1963321.8750 214
  302.3000 1508713.7500 164
  302.4000 1582961.5000 172
  302.5000 755205.5000 81
  302.6000 722748.5625 78
  302.7000 666532.3750 72
  302.8000 564707.0625 60
  302.9000 501914.6563 54
  303.0000 567889.1250 61
  303.1000 575101.6875 62
  303.2000 626226.6250 67
  303.3000 2309740.7500 252
  303.4000 5130094.0000 561
  303.5000 7941325.5000 869
  303.6000 8949610.0000 980
  303.7000 8946638.0000 979
  303.8000 8172342.0000 895
  303.9000 8564158.0000 938
  304.0000 8622493.0000 944
  304.1000 8293047.0000 908
  304.2000 9120380.0000 999
  304.3000 7185907.0000 786
  304.4000 7025956.5000 769
  304.5000 4636452.5000 507
  304.6000 3357694.5000 367
  304.7000 3178227.0000 347
  304.8000 3010639.5000 329
  304.9000 2923238.5000 319
  305.0000 3087857.2500 337
  305.1000 3208562.7500 350
  305.2000 3967799.0000 434
  305.3000 2940634.2500 321
  305.4000 2039267.0000 222
  305.5000 976887.8125 106
  305.6000 703232.1250 76
  305.7000 625378.0000 67
  305.8000 606497.8750 65
  305.9000 472427.6875 50
  306.0000 458214.5938 49
  306.1000 528855.9375 56
  306.2000 397331.4063 42
  306.3000 236744.2188 24
  306.4000 244593.2188 25
  606.9000 260503.4531 27
  607.1000 238017.0156 25
  607.2000 225500.9531 23