ACCESSION: MSBNK-RIKEN_NPDepo-CB000085
RECORD_TITLE: Dihydrolycorine; LC-ESI-QQQ; MS; [M+H]+
DATE: 2018.04.04
AUTHORS: Nogawa T, Okano A, CSRS, RIKEN
LICENSE: CC BY
COMMENT: Origin: Plant
COMMENT: SubCategory_DNP: Isoquinoline alkaloids, Amaryllidaceae alkaloids, Lycorine alkaloids

CH$NAME: Dihydrolycorine
CH$COMPOUND_CLASS: Alkaloids
CH$FORMULA: C16H19NO4
CH$EXACT_MASS: 289.3341
CH$SMILES: O[C@H]1CC2CCN3Cc4cc5c(cc4[C@H]([C@@H]1O)[C@@H]23)OCO5
CH$IUPAC: InChI=1S/C16H19NO4/c18-11-3-8-1-2-17-6-9-4-12-13(21-7-20-12)5-10(9)14(15(8)17)16(11)19/h4-5,8,11,14-16,18-19H,1-3,6-7H2/t8?,11-,14-,15+,16+/m0/s1
CH$LINK: CAS 6271-21-2
CH$LINK: CHEMSPIDER 432333 10050463 28426276
CH$LINK: INCHIKEY VJILFEGOWCJNIK-WIOQNRRMSA-N
CH$LINK: PUBCHEM CID:235311

AC$INSTRUMENT: ABSciex API3200 LC/MS system
AC$INSTRUMENT_TYPE: LC-ESI-QQQ
AC$MASS_SPECTROMETRY: MS_TYPE MS
AC$MASS_SPECTROMETRY: ION_MODE POSITIVE

MS$FOCUSED_ION: PRECURSOR_TYPE [M+H]+

PK$SPLASH: splash10-000f-0090000000-73de6752e5a9cbbd2491
PK$NUM_PEAK: 47
PK$PEAK: m/z int. rel.int.
  221.0000 159974.4219 26
  271.4000 160492.9531 26
  271.5000 152196.0781 24
  271.6000 235683.4688 39
  271.7000 247091.7188 41
  271.8000 252795.8438 42
  271.9000 539297.6875 91
  272.0000 295576.6563 49
  272.1000 316578.1250 53
  272.2000 343543.0938 57
  272.3000 267833.9375 44
  272.4000 175012.4844 28
  272.6000 130935.2813 21
  287.6000 266018.9688 44
  287.7000 194717.6094 32
  288.0000 137417.1719 22
  289.3000 725459.2500 122
  289.4000 2387170.5000 406
  289.5000 3556772.7500 605
  289.6000 5083141.0000 866
  289.7000 5143551.5000 876
  289.8000 5003024.0000 852
  289.9000 5534284.0000 943
  290.0000 5264375.5000 897
  290.1000 5222113.5000 890
  290.2000 5860197.0000 999
  290.3000 4983577.0000 849
  290.4000 3969543.0000 676
  290.5000 2613001.5000 444
  290.6000 1945361.3750 330
  290.7000 1461808.0000 248
  290.8000 1455326.0000 247
  290.9000 1514441.3750 257
  291.0000 1494477.0000 254
  291.1000 1263719.8750 214
  291.2000 1438213.7500 244
  291.3000 1461030.3750 248
  291.4000 1379876.3750 234
  291.5000 648712.9375 109
  291.6000 272241.6875 45
  291.7000 264204.0625 44
  291.8000 208718.5938 34
  291.9000 291168.9688 48
  292.0000 209496.4531 34
  292.1000 243721.0781 40
  292.2000 263166.9375 43
  292.3000 219608.2969 36