ACCESSION: MSBNK-RIKEN_NPDepo-CB000003
RECORD_TITLE: 9,10,16-Trihydroxyhexadecanoic acid; LC-ESI-QQQ; MS; [M+H]+
DATE: 2018.04.04
AUTHORS: Nogawa T, Okano A, CSRS, RIKEN
LICENSE: CC BY
COMMENT: Origin: Animal
COMMENT: SubCategory_DNP: Lipids, Fatty acids

CH$NAME: 9,10,16-Trihydroxyhexadecanoic acid
CH$COMPOUND_CLASS: Aliphatic natural products
CH$FORMULA: C16H32O5
CH$EXACT_MASS: 304.4304
CH$SMILES: O=C(O)CCCCCCCC(O)C(O)CCCCCCO
CH$IUPAC: InChI=1S/C16H32O5/c17-13-9-5-4-7-11-15(19)14(18)10-6-2-1-3-8-12-16(20)21/h14-15,17-19H,1-13H2,(H,20,21)
CH$LINK: CAS 18951-77-4
CH$LINK: CHEMSPIDER 10334
CH$LINK: INCHIKEY MEHUJCGAYMDLEL-UHFFFAOYSA-N
CH$LINK: COMPTOX DTXSID90862139
CH$LINK: PUBCHEM CID:10790

AC$INSTRUMENT: ABSciex API3200 LC/MS system
AC$INSTRUMENT_TYPE: LC-ESI-QQQ
AC$MASS_SPECTROMETRY: MS_TYPE MS
AC$MASS_SPECTROMETRY: ION_MODE POSITIVE

MS$FOCUSED_ION: PRECURSOR_TYPE [M+H]+

PK$SPLASH: splash10-0pb9-0097002000-04c996ac5ceb0c4082d6
PK$NUM_PEAK: 177
PK$PEAK: m/z int. rel.int.
  108.5000 205663.3438 30
  108.6000 302345.9063 44
  108.7000 350214.2188 51
  108.8000 368945.2813 54
  108.9000 441409.8750 65
  109.0000 481520.8750 71
  109.1000 302345.9063 44
  109.2000 476979.9063 71
  109.3000 399217.6875 59
  109.4000 397514.8438 59
  109.5000 290047.7813 42
  120.9000 206230.9688 30
  121.1000 219475.1250 32
  121.2000 185418.6406 27
  122.6000 190337.8906 27
  122.7000 224205.2031 32
  122.8000 193743.5469 28
  122.9000 182202.2031 26
  123.0000 292696.5625 43
  123.1000 279641.5938 41
  123.2000 175012.5000 25
  123.3000 148334.9219 21
  123.5000 290047.7813 42
  123.6000 151551.3594 21
  132.8000 404515.3750 60
  132.9000 260342.9219 38
  136.9000 145686.0781 21
  150.5000 146442.8906 21
  195.0000 178796.5625 26
  214.5000 764000.5000 114
  214.8000 150037.7500 21
  214.9000 185418.6406 27
  215.0000 211150.2031 30
  215.1000 212285.4375 31
  215.2000 274722.2813 40
  215.3000 211717.8281 30
  215.4000 192040.7188 28
  215.5000 255802.0469 37
  232.7000 303859.5313 44
  232.8000 512550.0938 76
  232.9000 460330.1875 68
  233.0000 476601.5313 70
  233.1000 521631.8438 77
  233.2000 457492.1250 68
  233.3000 437815.0625 65
  233.4000 472060.7188 70
  233.5000 382000.2500 56
  250.4000 280966.0000 41
  250.5000 2249809.5000 338
  250.6000 3333751.5000 502
  250.7000 4297739.5000 648
  250.8000 4044018.2500 609
  250.9000 4008826.2500 604
  251.0000 4029260.5000 607
  251.1000 3883385.0000 585
  251.2000 3767971.7500 568
  251.3000 3417000.5000 515
  251.4000 3975527.2500 599
  251.5000 3307452.2500 498
  251.6000 1439075.6250 216
  251.7000 1071076.5000 160
  251.8000 969663.9375 145
  251.9000 795408.1250 119
  252.0000 857088.2500 128
  252.1000 843654.7500 126
  252.2000 669399.1250 100
  252.3000 661452.6250 98
  252.4000 641018.7500 95
  252.5000 492494.6250 73
  252.6000 208501.3750 30
  268.4000 693995.5000 103
  268.5000 1832995.6250 275
  268.6000 3126952.5000 471
  268.7000 3482653.7500 525
  268.8000 3691155.2500 556
  268.9000 3591067.2500 541
  269.0000 3612068.2500 544
  269.1000 3626448.0000 546
  269.2000 3268854.7500 492
  269.3000 2759332.0000 415
  269.4000 3041433.5000 458
  269.5000 2154072.7500 324
  269.6000 1183652.0000 177
  269.7000 1053669.8750 158
  269.8000 563824.0000 84
  269.9000 628153.0000 93
  270.0000 648019.1875 96
  270.1000 676588.8750 101
  270.2000 620773.9375 92
  270.3000 872413.6250 130
  270.4000 837411.1875 125
  270.5000 439517.8438 65
  270.6000 194311.1563 28
  270.7000 158930.2656 23
  286.5000 220988.7344 32
  286.6000 1815967.3750 273
  286.8000 190527.1094 27
  286.9000 240665.8438 35
  287.0000 206230.9688 30
  287.1000 364971.9375 54
  287.2000 388054.6875 57
  287.3000 381243.4063 56
  287.4000 220610.3594 32
  287.5000 299318.6875 44
  304.4000 1458185.1250 219
  304.5000 3285504.7500 495
  304.6000 4934785.5000 744
  304.7000 5909935.5000 891
  304.8000 6441027.5000 972
  304.9000 6458622.5000 974
  305.0000 6619635.0000 999
  305.1000 5804171.5000 875
  305.2000 5907476.0000 891
  305.3000 6544899.5000 987
  305.4000 4567163.0000 688
  305.5000 4688822.0000 707
  305.6000 3738646.0000 563
  305.7000 4433966.0000 668
  305.8000 1121972.0000 168
  305.9000 1220925.0000 183
  306.0000 1213735.2500 182
  306.1000 1340311.8750 201
  306.2000 1207491.5000 181
  306.3000 1329149.0000 199
  306.4000 1033992.6875 155
  306.5000 885657.8750 132
  306.6000 305751.5625 45
  306.7000 369702.0313 54
  306.8000 404893.7500 60
  306.9000 314076.5000 46
  307.0000 222502.3750 32
  307.1000 250693.5469 36
  307.2000 229313.6719 33
  307.4000 200744.0469 29
  307.5000 152686.5781 22
  321.6000 228178.4531 33
  321.7000 283236.4063 41
  321.8000 410569.8750 61
  321.9000 422489.5938 62
  322.0000 430436.1250 64
  322.1000 321644.5625 47
  322.2000 430625.3438 64
  322.3000 403569.3125 59
  322.4000 276425.1250 40
  322.5000 333942.7813 49
  322.6000 151929.7656 21
  608.5000 181823.7969 26
  608.6000 678859.2500 101
  608.7000 1357718.5000 204
  608.8000 1378341.7500 207
  608.9000 1532541.7500 230
  609.0000 1777748.6250 267
  609.1000 1910568.6250 287
  609.2000 1574923.2500 236
  609.3000 1714744.0000 258
  609.4000 1749935.5000 263
  609.5000 1406532.7500 211
  609.6000 650857.2500 97
  609.7000 679048.5000 101
  609.8000 706861.3750 105
  609.9000 833059.6250 124
  610.0000 895307.1875 134
  610.1000 643667.5625 96
  610.2000 664669.1250 99
  610.3000 601097.0000 89
  610.4000 518036.9688 77
  610.5000 441031.4688 65
  610.6000 181823.7969 26
  610.8000 167822.7813 24
  610.9000 188824.2969 27
  611.0000 160822.2813 23
  611.2000 161011.5000 23
  625.9000 146821.3125 21
  626.0000 160443.8750 23
  626.1000 161011.5000 23
  626.5000 146821.3125 21
  627.3000 147010.5000 21