ACCESSION: MSBNK-Nihon_Univ-NU000668
RECORD_TITLE: 12-Oxo-5b-cholan-24-ic acid; LC-ESI-TOF; MS; NEGATIVE; in source decay -90 V
DATE: 2018.03.01
AUTHORS: Takashi Iida, Department of Chemistry, College of Humanities and Sciences, Nihon University
LICENSE: CC BY
COPYRIGHT: Takashi Iida, Department of Chemistry, College of Humanities and Sciences, Nihon University
COMMENT: BA-114-90. In-source decay
COMMENT: 1 microL of the bile acid in MeOH solution was flow injected. Sampling interval was 1 Hz.
COMMENT: This record was created by the financial support of MEXT/JSPS KAKENHI Grant Number 17HP8021 (2017) to the MassBank database committee of the Mass Spectrometry Society of Japan.

CH$NAME: 12-Oxo-5b-cholan-24-ic acid
CH$COMPOUND_CLASS: Natural Product; Bile acids
CH$FORMULA: C24H38O3
CH$EXACT_MASS: 374.28210
CH$SMILES: CC(CCC(=O)O)C1CCC2C1(C(=O)CC3C2CCC4C3(CCCC4)C)C
CH$IUPAC: InChI=1S/C24H38O3/c1-15(7-12-22(26)27)18-10-11-19-17-9-8-16-6-4-5-13-23(16,2)20(17)14-21(25)24(18,19)3/h15-20H,4-14H2,1-3H3,(H,26,27)/t15-,16+,17+,18-,19+,20+,23+,24-/m1/s1
CH$LINK: CHEMSPIDER 4446999
CH$LINK: INCHIKEY RVGVSOKFBAOUCH-LDTZHDHYSA-N
CH$LINK: LIPIDBANK BBA0132
CH$LINK: PUBCHEM CID:5283911

AC$INSTRUMENT: JMS-T100LP, JEOL
AC$INSTRUMENT_TYPE: LC-ESI-TOF
AC$MASS_SPECTROMETRY: MS_TYPE MS
AC$MASS_SPECTROMETRY: ION_MODE NEGATIVE
AC$MASS_SPECTROMETRY: IONIZATION ESI
AC$MASS_SPECTROMETRY: ORIFICE_TEMPERATURE 80 C
AC$MASS_SPECTROMETRY: ORIFICE_VOLTAGE -90 V
AC$MASS_SPECTROMETRY: SCAN_RANGE_M/Z 100-1000

PK$SPLASH: splash10-01t9-4009000000-252c09916712e0a69f20
PK$NUM_PEAK: 25
PK$PEAK: m/z int. rel.int.
  61.98 99 984
  68.99 15 152
  78.91 3 30
  79.95 3 32
  96.96 8 79
  232.95 2 21
  255.24 3 30
  265.16 5 52
  283.27 2 22
  297.16 3 27
  309.17 2 21
  311.17 10 103
  325.19 12 119
  326.20 2 22
  339.21 9 86
  371.27 2 20
  373.27 51 513
  374.28 12 116
  375.28 100 999
  376.29 30 302
  377.30 3 33
  381.24 3 27
  389.28 4 40
  432.32 2 24
  433.26 5 45