ACCESSION: MSBNK-NAIST-KNA00248
RECORD_TITLE: FAD; LC-ESI-ITFT; MS; POS
DATE: 2016.01.19 (Created 2009.11.17, modified 2011.08.03)
AUTHORS: Takahashi H, Kanaya S, Ogasawara N, Graduate School of Information Science, NAIST
LICENSE: CC BY-SA

CH$NAME: FAD
CH$NAME: Flavin adenine dinucleotide
CH$COMPOUND_CLASS: Natural Product
CH$FORMULA: C27H33N9O15P2
CH$EXACT_MASS: 785.15713
CH$SMILES: C(C(CN(c54)C(=N6)C(C(=O)NC6=O)=Nc(cc(c(c5)C)C)4)O)(O)C(O)COP(OP(OCC(O1)C(C(C1n(c2)c(n3)c(c(N)nc3)n2)O)O)(O)=O)(O)=O
CH$IUPAC: InChI=1S/C27H33N9O15P2/c1-10-3-12-13(4-11(10)2)35(24-18(32-12)25(42)34-27(43)33-24)5-14(37)19(39)15(38)6-48-52(44,45)51-53(46,47)49-7-16-20(40)21(41)26(50-16)36-9-31-17-22(28)29-8-30-23(17)36/h3-4,8-9,14-16,19-21,26,37-41H,5-7H2,1-2H3,(H,44,45)(H,46,47)(H2,28,29,30)(H,34,42,43)/t14-,15+,16+,19-,20+,21+,26+/m0/s1
CH$LINK: CAS 146-14-5
CH$LINK: CHEBI 16238
CH$LINK: KEGG C00016
CH$LINK: KNAPSACK C00001500
CH$LINK: NIKKAJI J39.053D
CH$LINK: PUBCHEM 3318
CH$LINK: INCHIKEY VWWQXMAJTJZDQX-UYBVJOGSSA-N
CH$LINK: COMPTOX DTXSID4048307

AC$INSTRUMENT: LTQ Orbitrap XL, Thermo Scientfic
AC$INSTRUMENT_TYPE: LC-ESI-ITFT
AC$MASS_SPECTROMETRY: MS_TYPE MS
AC$MASS_SPECTROMETRY: ION_MODE POSITIVE
AC$MASS_SPECTROMETRY: COLLISION_ENERGY 35eV
AC$MASS_SPECTROMETRY: IONIZATION ESI
AC$CHROMATOGRAPHY: COLUMN_NAME TOSOH TSKgel ODS-100V 5um Part no. 21456
AC$CHROMATOGRAPHY: FLOW_GRADIENT 0min:3%, 45min:97%, 50min:97%, 50.1:3%, 57min:3% (acetonitrile)
AC$CHROMATOGRAPHY: FLOW_RATE 0.5 ml/min
AC$CHROMATOGRAPHY: RETENTION_TIME 14.636688 min
AC$CHROMATOGRAPHY: SOLVENT A 0.1%formate-water
AC$CHROMATOGRAPHY: SOLVENT B 0.1%formate-acetonitrile

MS$FOCUSED_ION: BASE_PEAK 348.070190

PK$SPLASH: splash10-000j-0509700500-32ef201f1f33231cb5ca
PK$NUM_PEAK: 388
PK$PEAK: m/z int. rel.int.
  100.110145 4284.416504 1
  100.110713 3708.411133 1
  100.111848 261599.687500 38
  100.112794 7211.468262 1
  100.113362 5166.247559 1
  102.033553 110755.437500 16
  102.091202 68376.390625 10
  103.086455 6272.439453 1
  107.069996 8746.333984 1
  109.022163 10210.023438 1
  109.521416 4331.000488 1
  110.019964 308219.593750 45
  110.021708 3902.065430 1
  110.521485 17738.341797 3
  111.018931 3578.153809 1
  111.020036 48347.175781 7
  112.017680 31063.783203 5
  113.016576 4801.276855 1
  113.963374 6639.900879 1
  114.127396 11412.942383 2
  116.052719 4331.451172 1
  117.102367 3697.339355 1
  118.086052 28303.339844 4
  122.963861 7805.255859 1
  123.055085 5123.500488 1
  125.985947 3610.980469 1
  128.106709 38884.781250 6
  129.127203 5967.690918 1
  130.122362 3982.413574 1
  130.158817 62588.027344 9
  130.491545 12809.077148 2
  133.079206 48760.691406 7
  135.101344 5641.418457 1
  136.021355 8379.997070 1
  136.057919 8254.360352 1
  136.059118 3556.975586 1
  136.061516 119913.492188 18
  136.063015 3889.090332 1
  137.132305 36749.976563 5
  139.982321 8075.561523 1
  141.958490 7392.386230 1
  149.023248 130542.296875 19
  151.096028 12189.564453 2
  154.990068 18842.279297 3
  155.142891 73901.210938 11
  156.146743 3822.336426 1
  158.002927 66417.937500 10
  158.004428 5051.809570 1
  158.096379 87156.390625 13
  158.961247 26910.462891 4
  159.112778 11484.801758 2
  161.110679 6576.076172 1
  162.998158 31320.210938 5
  163.132671 243740.625000 36
  163.134639 5912.709473 1
  164.136124 7797.757813 1
  167.012934 6288.604004 1
  167.033727 18211.042969 3
  170.096285 106223.101563 16
  171.099654 5963.739746 1
  171.110223 6332.535645 1
  171.134324 3742.325684 1
  171.138553 48292.109375 7
  171.140244 8161.505859 1
  171.141936 9754.575195 1
  171.144050 5787.647461 1
  171.145319 21399.503906 3
  171.149125 1870280.250000 274
  171.152932 21601.533203 3
  171.156738 12079.512695 2
  171.188464 6573.017090 1
  172.152452 143503.062500 21
  172.154585 4743.208008 1
  172.169092 7836.072266 1
  173.078147 6808.172363 1
  174.123678 8652.635742 1
  174.127584 796063.750000 117
  174.131490 9544.977539 1
  174.135397 4288.744141 1
  175.089843 40025.410156 6
  175.130986 74652.945313 11
  176.143085 10560.946289 2
  178.035287 26172.853516 4
  179.063653 160975.406250 24
  180.066718 6012.237305 1
  182.984796 60113.332031 9
  185.114619 10478.014648 2
  186.184865 47297.949219 7
  186.955984 14561.684570 2
  187.122192 4338.917480 1
  187.126544 566547.937500 83
  187.128961 8102.380859 1
  187.130412 6093.312500 1
  187.188448 3494.473145 1
  188.129475 30915.986328 5
  188.997594 3929.363770 1
  189.121821 8421.239258 1
  189.996332 3841.722168 1
  190.993035 98870.656250 14
  192.989857 4541.359375 1
  194.117473 16061.507813 2
  195.087107 5875.416016 1
  195.122625 32368.216797 5
  199.029134 20549.462891 3
  199.177187 3996.619629 1
  199.180373 319634.062500 47
  199.183028 3574.299316 1
  199.987228 8122.260742 1
  200.183421 20249.257813 3
  205.096502 13171.851563 2
  207.094377 7835.992188 1
  208.190213 3484.923340 1
  209.138152 5800.722656 1
  214.216026 7745.358398 1
  215.157172 7162.438477 1
  216.027748 4862.931152 1
  217.104082 16383.210938 2
  220.111991 48798.699219 7
  221.115280 4923.555664 1
  222.111688 3989.514648 1
  223.063237 7781.447266 1
  224.126718 4255.246094 1
  225.195906 6746.527832 1
  226.158371 17551.501953 3
  227.161937 3679.922363 1
  227.982221 4149.519043 1
  228.232103 17291.386719 3
  232.169093 6592.364746 1
  233.174638 54367.761719 8
  240.179082 3701.992188 1
  240.180488 3752.671875 1
  243.087108 5160.841797 1
  255.155987 4729.560059 1
  256.262765 3791.599121 1
  264.130698 3995.524902 1
  270.190927 3600.962402 1
  275.146239 7608.803711 1
  275.196246 15861.382813 2
  277.200773 33567.773438 5
  279.158552 39931.292969 6
  279.162076 4581.138184 1
  280.162057 4327.954590 1
  282.221186 69384.625000 10
  283.224159 7023.636719 1
  294.226753 4998.422852 1
  299.182617 14715.216797 2
  305.195176 5246.359375 1
  312.682857 3639.905762 1
  320.294622 4857.082520 1
  321.225628 8373.715820 1
  322.257928 7830.646484 1
  327.200623 29469.992188 4
  343.208159 11164.454102 2
  344.228852 25532.281250 4
  345.231084 4172.698730 1
  346.195111 4958.507324 1
  347.428461 3632.995117 1
  347.732011 6417.952637 1
  347.856973 3948.530273 1
  347.957482 16396.851563 2
  348.027374 8200.449219 1
  348.034732 5107.962402 1
  348.037185 7733.161133 1
  348.044543 16198.423828 2
  348.048223 28377.453125 4
  348.051902 22382.154297 3
  348.055582 35454.617188 5
  348.059261 58571.781250 9
  348.062941 73574.687500 11
  348.070300 6818615.500000 999
  348.076433 94045.054688 14
  348.080113 66679.625000 10
  348.086246 14956.517578 2
  348.091153 29105.748047 4
  348.098513 4525.890625 1
  348.108327 8718.827148 1
  348.112008 5140.639648 1
  348.115688 4921.992188 1
  348.123049 4273.272461 1
  348.127957 3656.212891 1
  348.183173 16005.533203 2
  348.285051 4726.374512 1
  348.409083 6900.608887 1
  348.713919 4590.290527 1
  349.073352 678104.562500 99
  349.079512 8135.083984 1
  349.083208 6006.709473 1
  349.094295 3503.400879 1
  349.181783 42647.644531 6
  349.960767 4830.660156 1
  350.073323 42553.738281 6
  350.184696 9050.105469 1
  358.241623 4872.214844 1
  366.284389 6871.729004 1
  372.258025 18816.697266 3
  373.262604 3887.689941 1
  391.258042 5577.898926 1
  391.271198 13759.947266 2
  391.284356 1184607.625000 174
  391.291666 16955.841797 2
  391.296052 9731.795898 1
  391.309210 5218.102539 1
  392.287721 263251.625000 39
  393.290531 17538.097656 3
  393.572066 11272.500000 2
  393.576491 8779.449219 1
  393.585340 1114975.375000 163
  393.597139 10383.102539 2
  393.611889 4369.764160 1
  394.087275 320483.062500 47
  394.094664 6720.630859 1
  394.588691 31058.435547 5
  395.088098 7429.523926 1
  404.569196 19283.281250 3
  405.070736 7450.734375 1
  405.556240 3846.690918 1
  405.563953 105668.718750 15
  406.065799 22510.214844 3
  412.548815 3633.114258 1
  412.558312 133830.500000 20
  413.060514 29968.732422 4
  413.265143 18802.162109 3
  413.562046 7170.126953 1
  415.542132 8981.674805 1
  416.046589 4190.871094 1
  419.314811 7262.661621 1
  419.546829 17323.332031 3
  420.040710 55198.410156 8
  420.530578 4952.811523 1
  420.535464 6092.321289 1
  420.545238 458305.062500 67
  420.553383 7764.166992 1
  420.558270 4816.583008 1
  421.045779 115416.476563 17
  421.053939 3829.798828 1
  421.084947 6574.006836 1
  421.542310 9250.068359 1
  421.548850 14748.783203 2
  422.047909 3766.751465 1
  422.541293 8914.791992 1
  423.548769 6366.566895 1
  424.548287 89768.218750 13
  425.049374 22193.943359 3
  427.377851 15663.035156 2
  435.166017 4227.217285 1
  436.341219 18090.119141 3
  436.444534 4801.147461 1
  437.343196 5605.343262 1
  438.620916 4630.714844 1
  438.797952 3859.360840 1
  438.940352 12925.514648 2
  438.976832 3815.342285 1
  439.039379 7169.451172 1
  439.060231 4941.831055 1
  439.063706 9499.516602 1
  439.070657 22295.142578 3
  439.079346 12486.235352 2
  439.084560 45291.476563 7
  439.089774 56530.644531 8
  439.100201 6114465.500000 896
  439.114105 48293.910156 7
  439.124534 16910.212891 2
  439.131486 26869.878906 4
  439.140177 5367.633301 1
  439.145392 8163.851563 1
  439.154083 4285.544922 1
  439.159298 5567.468262 1
  439.261876 13983.186523 2
  439.404503 5141.960449 1
  439.580272 5554.280762 1
  440.014056 3631.811523 1
  440.073337 3609.503418 1
  440.076825 3529.597656 1
  440.087288 9319.917969 1
  440.092519 10308.283203 2
  440.102982 1086986.125000 159
  440.118678 6478.679199 1
  440.134375 3822.042480 1
  441.105702 72288.125000 11
  441.112702 8945.762695 1
  441.781933 4464.070313 1
  442.106585 4888.099121 1
  457.109366 14889.234375 2
  464.371917 4165.770508 1
  527.714716 8152.343750 1
  532.431012 3949.625488 1
  532.586523 4561.941406 1
  534.369313 3516.203125 1
  537.093243 4659.719238 1
  540.039489 3886.327148 1
  540.371509 8382.313477 1
  540.703835 3718.833008 1
  542.081501 3626.854492 1
  542.417793 19071.410156 3
  542.749620 7211.320801 1
  543.088924 4147.905762 1
  550.025204 3726.806152 1
  560.726600 4054.774902 1
  616.182321 4154.661133 1
  779.809184 3638.279785 1
  785.782747 6924.786621 1
  786.049090 4876.843750 1
  786.074066 5959.184570 1
  786.090718 10809.482422 2
  786.099044 8477.755859 1
  786.124023 23891.085938 4
  786.165657 4070747.500000 596
  786.198967 30098.478516 4
  786.211459 4862.048340 1
  786.219787 10329.586914 2
  786.236443 13709.812500 2
  786.269758 6595.032227 1
  786.294745 3942.897949 1
  786.498851 4336.549316 1
  786.548848 6616.286133 1
  786.628020 4619.886230 1
  786.665527 835011.562500 122
  786.686365 9506.081055 1
  786.698869 4668.027832 1
  787.128331 7467.392578 1
  787.165874 1283726.750000 188
  787.199247 9668.734375 1
  787.240967 3617.410645 1
  787.666698 72865.218750 11
  788.168000 160138.531250 23
  788.669781 4727.515137 1
  789.172041 16359.056641 2
  790.564130 4064.543945 1
  791.068201 5299.629883 1
  792.595955 4388.440918 1
  797.154848 38907.527344 6
  797.656726 22653.802734 3
  798.142042 13475.405273 2
  798.159078 11636.269531 2
  798.640590 6509.515137 1
  799.143872 7775.853516 1
  801.547401 3779.450684 1
  802.092049 3526.018066 1
  804.134048 6860.017578 1
  804.474421 6273.942871 1
  804.806385 5382.000000 1
  805.134239 17640.695313 3
  805.639354 6820.617676 1
  806.140621 8164.740234 1
  808.119998 7702.558594 1
  808.146034 27275.605469 4
  808.623582 4372.624023 1
  809.145027 5459.442871 1
  810.054414 22615.572266 3
  810.555449 9954.700195 1
  812.616747 11587.657227 2
  813.120161 59582.664063 9
  813.624044 40841.238281 6
  814.124007 13602.957031 2
  814.628822 9355.437500 1
  815.120921 3684.962402 1
  817.124661 16702.359375 2
  817.627855 7217.334473 1
  818.131514 8129.355469 1
  824.109105 4819.716797 1
  839.074237 6259.393066 1
  840.080549 8735.370117 1
  848.089311 5634.248535 1
  1047.888260 15229.467773 2
  1048.215105 12801.043945 2
  1048.554929 13332.348633 2
  1048.888502 15838.527344 2
  1049.228654 4147.690430 1
  1049.890177 3525.865723 1
  1055.541707 4214.105469 1
  1178.744787 70247.718750 10
  1179.249460 48846.167969 7
  1179.746803 30267.996094 4
  1180.252120 17163.603516 3
  1180.757761 6285.375977 1
  1189.736856 7195.122070 1
  1190.233093 6197.175293 1
  1190.729641 3858.710938 1
  1191.242031 3685.199707 1
  1205.700590 5247.250977 1
  1206.206850 8819.066406 1
  1206.705510 3559.207031 1
  1221.995860 5110.406250 1
  1224.258223 3660.750000 1
  1309.605527 6085.422363 1
  1309.936804 8565.272461 1
  1310.268207 8282.803711 1
  1321.983330 3866.325684 1