ACCESSION: MSBNK-NAIST-KNA00205
RECORD_TITLE: Acetyl-CoA; LC-ESI-ITFT; MS; POS
DATE: 2016.01.19 (Created 2009.11.17, modified 2011.08.03)
AUTHORS: Takahashi H, Kanaya S, Ogasawara N, Graduate School of Information Science, NAIST
LICENSE: CC BY-SA

CH$NAME: Acetyl-CoA
CH$NAME: Acetyl coenzyme A
CH$COMPOUND_CLASS: Natural Product
CH$FORMULA: C23H38N7O17P3S
CH$EXACT_MASS: 809.12577
CH$SMILES: CC(=O)SCCNC(=O)CCNC(=O)C(O)C(C)(C)COP(O)(=O)OP(O)(=O)OCC(O1)C(OP(O)(O)=O)C(O)C1n(c2)c(n3)c(c(N)nc3)n2
CH$IUPAC: InChI=1S/C23H38N7O17P3S/c1-12(31)51-7-6-25-14(32)4-5-26-21(35)18(34)23(2,3)9-44-50(41,42)47-49(39,40)43-8-13-17(46-48(36,37)38)16(33)22(45-13)30-11-29-15-19(24)27-10-28-20(15)30/h10-11,13,16-18,22,33-34H,4-9H2,1-3H3,(H,25,32)(H,26,35)(H,39,40)(H,41,42)(H2,24,27,28)(H2,36,37,38)/t13-,16-,17-,18+,22-/m1/s1
CH$LINK: CAS 72-89-9
CH$LINK: CHEBI 15351
CH$LINK: KEGG C00024
CH$LINK: KNAPSACK C00007259
CH$LINK: NIKKAJI J192.549K
CH$LINK: PUBCHEM 3326
CH$LINK: INCHIKEY ZSLZBFCDCINBPY-ZSJPKINUSA-N

AC$INSTRUMENT: LTQ Orbitrap XL, Thermo Scientfic
AC$INSTRUMENT_TYPE: LC-ESI-ITFT
AC$MASS_SPECTROMETRY: MS_TYPE MS
AC$MASS_SPECTROMETRY: ION_MODE POSITIVE
AC$MASS_SPECTROMETRY: COLLISION_ENERGY 35eV
AC$MASS_SPECTROMETRY: IONIZATION ESI
AC$CHROMATOGRAPHY: COLUMN_NAME TOSOH TSKgel ODS-100V 5um Part no. 21456
AC$CHROMATOGRAPHY: FLOW_GRADIENT 0min:3%, 45min:97%, 50min:97%, 50.1:3%, 57min:3% (acetonitrile)
AC$CHROMATOGRAPHY: FLOW_RATE 0.5 ml/min
AC$CHROMATOGRAPHY: RETENTION_TIME 13.640973 min
AC$CHROMATOGRAPHY: SOLVENT A 0.1%formate-water
AC$CHROMATOGRAPHY: SOLVENT B 0.1%formate-acetonitrile

MS$FOCUSED_ION: BASE_PEAK 405.569763

PK$SPLASH: splash10-0ab9-0601910030-0f765c91459dd54c35cc
PK$NUM_PEAK: 1029
PK$PEAK: m/z int. rel.int.
  100.110145 2758.586426 1
  100.111848 246860.843750 80
  100.112794 4332.180664 1
  100.113362 3204.813965 1
  100.511309 2030.169556 1
  100.842929 1898.726196 1
  101.095891 4857.149902 2
  101.098195 1686.019897 1
  101.115285 3315.663086 1
  101.261596 1691.037231 1
  102.031217 1973.555298 1
  102.033553 159917.812500 52
  102.054776 3187.614746 1
  102.091007 73196.351563 24
  102.535127 2797.530273 1
  102.539441 1719.304565 1
  102.941104 1566.050171 1
  103.048508 1573.760132 1
  103.074990 2080.584473 1
  103.086257 2383.645508 1
  103.170527 1688.707153 1
  103.479210 1967.447388 1
  103.769910 1905.423218 1
  104.029964 3076.920898 1
  105.201176 1700.164917 1
  105.303768 1808.936646 1
  105.653664 1980.098755 1
  106.028606 1771.543091 1
  106.493090 1674.384644 1
  106.590718 1579.071167 1
  106.834542 1573.891235 1
  107.069996 14077.362305 5
  107.312317 1960.017212 1
  107.618909 1720.109741 1
  108.888762 1781.401001 1
  109.021948 4319.970215 1
  109.022593 2687.166016 1
  109.521632 4005.731445 1
  109.540470 1744.056274 1
  109.549565 1980.988403 1
  109.871239 1721.079956 1
  110.016041 2210.109375 1
  110.019746 345161.062500 112
  110.021708 2659.709473 1
  110.519730 2703.038574 1
  110.521485 7547.742188 2
  110.576592 1643.669556 1
  111.020036 56488.625000 18
  111.020919 3875.588867 1
  111.039040 3202.128906 1
  111.521744 3477.574707 1
  111.644193 1705.836304 1
  111.837851 1577.155640 1
  112.017456 14330.273438 5
  112.111344 3191.963867 1
  112.841583 1744.474976 1
  113.016576 2939.042480 1
  113.059253 4045.915527 1
  113.799247 1738.717651 1
  113.952115 2518.163574 1
  113.963374 14429.972656 5
  114.073066 3241.134277 1
  114.127396 10668.346680 3
  115.017120 2630.630859 1
  115.051378 1710.869751 1
  115.111540 4774.919922 2
  116.042093 1899.476440 1
  116.070432 1636.694702 1
  116.106579 2568.523926 1
  116.523129 1618.593140 1
  116.523841 1778.623413 1
  117.011943 2422.777344 1
  117.101888 3969.169434 1
  118.067876 2462.260742 1
  119.013242 3548.265137 1
  119.063532 4261.635254 1
  120.342432 1746.578735 1
  121.636220 1658.125854 1
  121.959429 2843.344238 1
  122.469572 1791.469604 1
  122.963604 6266.736816 2
  123.048639 1714.292847 1
  123.050702 1999.605835 1
  123.053022 4583.780273 1
  123.053538 3866.305176 1
  123.055343 540538.375000 176
  123.057664 4208.960938 1
  123.059726 4667.002441 2
  123.079067 2154.582520 1
  124.058233 13464.064453 4
  124.060582 1925.695190 1
  125.615493 1941.740356 1
  126.077079 2296.395996 1
  127.697971 2256.011719 1
  128.106709 56642.105469 18
  128.142869 3873.654297 1
  128.337625 1657.640991 1
  129.110021 2260.363281 1
  129.127203 13878.901367 5
  129.391737 1868.194946 1
  130.008048 2329.463379 1
  130.122362 3538.289551 1
  130.158817 19029.417969 6
  130.159939 2212.018555 1
  130.491545 9921.138672 3
  130.725836 1818.284790 1
  131.070095 5460.205078 2
  131.117725 1633.954224 1
  131.323284 1922.357788 1
  131.976371 1702.159302 1
  132.003295 2765.782715 1
  132.080101 2553.069824 1
  133.079206 67532.671875 22
  133.080655 1696.486938 1
  133.085585 2970.712402 1
  134.200620 1664.583374 1
  134.423188 1732.211060 1
  135.101641 4378.903809 1
  135.200466 1650.764526 1
  136.021355 10160.534180 3
  136.061516 48958.929688 16
  137.132305 44571.175781 14
  138.135405 2150.860352 1
  138.977949 1778.187378 1
  139.981695 9833.701172 3
  139.983572 2030.556274 1
  140.143253 1918.335083 1
  140.348735 1915.880981 1
  140.961576 1815.854614 1
  141.697201 1680.953979 1
  141.945073 1612.178345 1
  141.946671 2391.963379 1
  141.958171 7275.604980 2
  142.122204 4797.481934 2
  142.158374 2163.131836 1
  143.060023 1896.054565 1
  143.102372 1648.418335 1
  143.142476 3314.285645 1
  144.008462 2026.332397 1
  144.080628 2069.997559 1
  145.132998 3169.194824 1
  147.094541 3702.242188 1
  147.338135 1825.189819 1
  148.242534 1692.597046 1
  149.023248 145242.453125 47
  149.080305 12405.193359 4
  149.742285 1700.671753 1
  149.954329 2063.673340 1
  149.966122 6470.988281 2
  150.026498 3053.933105 1
  150.643446 1765.043579 1
  151.096379 27571.953125 9
  151.554529 1890.295776 1
  154.937963 1903.786987 1
  154.989704 29896.230469 10
  155.142891 93012.117188 30
  155.144716 2232.610840 1
  156.146006 2742.981445 1
  156.174388 2726.758789 1
  157.133208 2499.660645 1
  158.002552 104472.187500 34
  158.088870 2647.764648 1
  158.096379 79339.906250 26
  158.456320 1577.895874 1
  158.961247 8844.758789 3
  159.057823 2239.361816 1
  159.112778 12028.512695 4
  159.249342 1651.421753 1
  161.109906 4762.041504 2
  161.756514 1822.828247 1
  162.998158 37010.597656 12
  163.024497 1608.999634 1
  163.096864 1806.237671 1
  163.130310 2326.098145 1
  163.132671 330407.281250 107
  164.136124 9065.305664 3
  165.011450 1804.953247 1
  167.012526 5864.023926 2
  167.033727 25961.484375 8
  168.123257 4551.273438 1
  168.982573 2049.256348 1
  169.043167 1731.012817 1
  169.976926 3002.019043 1
  170.096285 122191.773438 40
  171.062460 2159.793945 1
  171.099654 6731.561523 2
  171.110223 5272.762207 2
  171.129250 2679.615234 1
  171.138553 63272.589844 21
  171.140244 4095.771973 1
  171.141513 6500.649902 2
  171.145319 15924.334961 5
  171.146588 9571.946289 3
  171.149125 1950609.750000 634
  171.152932 15790.170898 5
  171.154201 3449.873535 1
  171.156738 9017.211914 3
  171.160545 2793.375000 1
  171.188041 6303.688965 2
  171.221891 1800.534546 1
  172.132828 2230.749512 1
  172.140933 3119.725586 1
  172.146479 2634.067383 1
  172.152452 160952.484375 52
  172.155865 2484.667480 1
  172.169092 10424.567383 3
  173.078147 22403.650391 7
  173.153437 3627.410156 1
  174.119772 2158.517578 1
  174.120640 1721.339478 1
  174.123678 5408.058594 2
  174.124980 3409.260742 1
  174.127584 779124.500000 253
  174.131490 6273.291016 2
  175.035592 3047.490723 1
  175.053090 2771.544922 1
  175.089406 42108.894531 14
  175.130548 77097.289063 25
  175.467674 2032.972046 1
  176.012455 2306.925293 1
  176.143085 6967.645020 2
  177.565981 1657.610474 1
  178.034839 27805.527344 9
  179.063653 188202.515625 61
  179.090811 5888.999023 2
  180.030668 2520.722656 1
  180.066718 8679.439453 3
  180.158947 4342.561035 1
  180.989441 5067.943848 2
  181.058907 4565.816406 1
  181.885909 1742.238403 1
  182.984796 76216.476563 25
  184.474529 3409.501465 1
  184.984814 3341.609375 1
  185.114619 32472.564453 11
  185.154111 2343.291016 1
  185.868083 1770.198853 1
  186.118182 3028.369629 1
  186.184865 49933.957031 16
  186.955501 2937.801758 1
  187.121709 4897.739258 2
  187.123159 2596.514160 1
  187.126060 643382.375000 209
  187.129445 3855.169434 1
  187.130412 5167.192383 2
  187.926882 1833.604858 1
  188.125088 4170.796875 1
  188.129475 39426.203125 13
  188.143122 5617.179199 2
  188.997103 3856.460449 1
  189.121821 9048.604492 3
  189.922153 1768.118042 1
  189.996826 2618.695801 1
  190.049272 4929.740234 2
  190.159182 4606.022949 1
  190.979574 2600.653809 1
  190.992536 114361.734375 37
  191.992576 5217.208496 2
  192.976184 2437.429688 1
  192.989857 2074.601074 1
  194.117473 17411.892578 6
  195.087107 8741.337891 3
  195.122110 41406.433594 13
  195.991447 1789.881226 1
  196.153765 4038.708984 1
  196.169333 2500.586914 1
  198.184844 2489.502441 1
  199.029134 29466.554688 10
  199.180373 331784.843750 108
  199.184621 3406.546387 1
  199.189400 1902.692017 1
  199.987228 5568.240723 2
  200.183421 22632.560547 7
  200.201077 3418.031250 1
  201.068529 4222.461914 1
  201.072299 2742.635742 1
  204.137860 4308.908691 1
  204.884181 1659.845581 1
  207.094377 2497.175293 1
  208.190213 2365.714844 1
  209.137581 14864.666016 5
  209.192434 1786.422241 1
  212.143070 2785.909668 1
  213.159308 4283.402344 1
  214.158593 1909.871460 1
  214.216026 3446.692871 1
  215.157172 6805.868652 2
  216.174158 2733.084473 1
  216.205980 3310.033691 1
  217.104082 31749.152344 10
  218.686685 1814.623901 1
  220.111991 97798.140625 32
  220.787112 2055.110352 1
  221.114659 8456.609375 3
  222.111688 9608.136719 3
  223.062608 12762.833984 4
  223.132473 4499.629883 1
  223.987985 2755.099609 1
  224.127351 13807.328125 4
  225.195906 6591.871094 2
  226.158371 13510.486328 4
  226.164153 3319.291016 1
  226.216200 2220.479004 1
  227.161290 2475.228516 1
  227.982871 3121.089844 1
  228.232103 23248.773438 8
  229.235096 3450.544434 1
  231.119592 17800.220703 6
  232.168425 4891.301758 2
  233.174638 86767.335938 28
  234.177930 5429.104980 2
  239.148196 3079.260254 1
  240.179785 7754.265625 3
  243.121473 1976.073364 1
  244.238734 1884.784790 1
  245.100404 2435.317871 1
  246.018383 1796.777466 1
  247.450998 1594.588257 1
  250.955927 1966.166382 1
  252.278238 1780.516968 1
  254.196394 3020.328613 1
  255.110572 1855.774292 1
  255.155987 11426.616211 4
  256.145801 2810.303711 1
  256.262765 5614.328613 2
  256.535734 1819.266724 1
  256.647529 1930.265991 1
  260.118837 2111.466309 1
  261.126539 3708.088867 1
  261.131321 2365.883301 1
  261.779729 1706.565796 1
  262.128084 1732.995483 1
  263.977520 1815.004272 1
  264.132320 5140.231934 2
  264.634124 2341.513184 1
  267.172151 2564.443359 1
  267.687611 1936.911499 1
  268.082647 4195.974121 1
  270.592360 1699.736938 1
  272.773766 2164.062012 1
  274.158392 3464.168457 1
  277.200773 46935.929688 15
  278.204248 2183.311523 1
  279.158552 55041.914063 18
  280.161171 4425.879395 1
  281.420499 1973.822632 1
  282.221186 70400.929688 23
  283.174649 44036.296875 14
  283.224159 6363.895020 2
  283.227760 3120.298340 1
  284.178188 5534.571289 2
  286.081571 1765.485229 1
  290.069292 1852.972290 1
  294.226753 14950.984375 5
  295.405674 1839.912231 1
  299.182617 41764.394531 14
  300.185074 2537.580078 1
  300.200792 36804.894531 12
  301.203438 2575.171875 1
  301.604716 1728.960327 1
  303.136112 8888.117188 3
  304.099415 1562.999878 1
  305.155904 57529.523438 19
  305.160938 3583.814941 1
  305.195176 6353.930176 2
  306.159211 6136.062500 2
  309.309945 2099.240234 1
  310.685214 2460.561035 1
  310.712109 2025.990112 1
  314.216378 2479.159668 1
  317.543927 1934.495239 1
  318.543482 1712.198364 1
  320.006810 1864.439575 1
  320.293539 6122.787598 2
  321.129954 2235.708008 1
  321.226716 11591.799805 4
  322.220780 2921.438477 1
  322.259021 8197.738281 3
  323.054889 3350.932129 1
  323.261178 4011.857910 1
  327.176029 6836.737305 2
  328.231553 17121.421875 6
  329.434451 1694.328491 1
  336.237656 2416.471680 1
  336.315696 2228.782715 1
  338.253223 4933.541504 2
  338.501296 1827.716187 1
  341.069671 1635.171265 1
  343.208159 15771.530273 5
  343.551894 1864.465454 1
  344.210758 3377.934082 1
  345.130543 1766.386597 1
  349.219993 2327.645996 1
  350.252784 3102.630371 1
  366.283065 6153.453613 2
  371.203456 5923.101563 2
  371.275062 2073.520020 1
  372.544440 23008.275391 7
  373.035233 2505.267090 1
  373.047481 4071.340820 1
  376.931761 1658.643433 1
  382.280699 1568.318237 1
  383.092355 2813.954102 1
  383.354503 1810.782593 1
  384.563853 136207.078125 44
  385.067179 10893.458008 4
  385.098580 2406.396973 1
  385.562913 3431.351074 1
  385.929256 1864.064819 1
  387.306264 1872.011597 1
  387.523753 1668.925171 1
  387.529517 3433.135254 1
  388.172986 2105.785156 1
  388.268345 1812.253540 1
  391.149890 2916.279785 1
  391.256580 3700.360840 1
  391.260966 3098.038086 1
  391.263889 2302.517578 1
  391.271198 9815.195313 3
  391.284356 1352673.750000 440
  391.291666 11407.740234 4
  391.297514 7540.971680 2
  391.418890 3029.792480 1
  391.518374 2253.422363 1
  392.270111 3062.634277 1
  392.287721 315851.406250 103
  392.300930 2718.461914 1
  393.290531 14794.791992 5
  393.424628 2119.571289 1
  394.279446 2907.776367 1
  396.542795 9489.835938 3
  396.559203 1974.232788 1
  396.983162 1867.614868 1
  397.506582 2055.299805 1
  397.544009 1907.871948 1
  401.403158 1886.194946 1
  401.723866 1745.939575 1
  404.024099 15267.422852 5
  405.428229 7486.190430 2
  405.530016 2686.746094 1
  405.536186 3264.443848 1
  405.540813 7849.508789 3
  405.545441 5658.057617 2
  405.548526 6056.177246 2
  405.554697 14535.418945 5
  405.560868 11523.310547 4
  405.570124 3073801.000000 999
  405.584009 17602.972656 6
  405.588638 2941.994141 1
  405.591723 2505.147949 1
  405.596352 12857.144531 4
  405.611781 3593.140625 1
  405.712094 6001.756348 2
  406.042617 2134.007813 1
  406.047253 2572.001465 1
  406.056526 4360.158691 1
  406.061162 5188.427734 2
  406.070436 841079.437500 273
  406.085892 5335.490234 2
  406.368901 2725.011230 1
  406.565480 41004.128906 13
  406.571674 140650.125000 46
  406.577868 7140.392578 2
  407.067636 17908.310547 6
  407.573831 3255.536621 1
  408.540701 2948.433105 1
  409.041833 2328.367188 1
  410.018640 4438.349609 1
  410.026481 5651.372559 2
  410.037459 1597.244019 1
  411.008392 2542.582031 1
  411.017836 7554.607422 2
  411.523535 4740.999512 2
  412.001733 2330.076172 1
  413.265143 32807.199219 11
  413.361959 3965.444336 1
  414.268274 6456.194824 2
  415.526133 12308.439453 4
  416.027354 3041.033203 1
  416.524666 3776.726074 1
  416.551964 4489.320801 1
  416.558388 3977.806152 1
  417.055044 2233.508301 1
  417.533250 7502.530273 2
  417.538084 3044.315430 1
  417.549365 946896.312500 308
  417.559035 5378.258789 2
  417.563870 5976.873535 2
  417.902530 2327.929688 1
  418.049410 253854.421875 83
  418.545501 24208.111328 8
  418.550353 20602.714844 7
  419.047337 3316.996582 1
  419.314811 8158.091797 3
  422.287117 1975.590698 1
  422.324819 8777.749023 3
  423.329875 4205.084961 1
  424.543330 63291.750000 21
  424.551592 2053.304199 1
  425.044408 13248.940430 4
  425.539741 2899.906738 1
  426.356690 4079.720215 1
  426.529680 7693.873047 3
  427.030945 3482.100098 1
  427.094291 2815.154785 1
  427.377851 12427.526367 4
  427.528086 88997.820313 29
  427.564822 423569.812500 138
  427.573172 4409.546387 1
  428.036131 33211.140625 11
  428.046168 3595.497070 1
  428.066241 74026.132813 24
  428.380914 5286.382324 2
  428.524975 7420.498535 2
  428.533353 2130.338379 1
  428.560164 5536.491211 2
  428.566867 14543.372070 5
  429.039835 3995.521484 1
  429.048228 2051.859863 1
  429.065015 2714.065430 1
  430.011701 2087.045410 1
  430.530930 1937.293091 1
  431.025746 10157.366211 3
  431.531575 5361.893555 2
  432.024725 355071.156250 115
  432.528915 308327.687500 100
  432.965914 2002.178345 1
  433.022075 3618.585938 1
  433.030585 39460.664063 13
  433.522898 3054.830078 1
  433.529718 10050.475586 3
  433.536538 2787.532715 1
  434.024590 1957.410034 1
  434.031422 6411.434082 2
  434.527154 4283.523926 1
  434.540841 2863.605469 1
  434.556240 4920.707520 2
  434.561373 5897.474121 2
  434.571640 955853.125000 311
  434.583618 5076.139160 2
  434.602442 3702.384766 1
  435.063156 1735.687622 1
  435.073440 244981.359375 80
  435.082011 4682.979492 2
  435.164302 5234.542480 2
  435.522886 1891.795776 1
  435.534903 56283.574219 18
  435.567525 19838.640625 6
  435.574393 36660.617188 12
  436.034934 40613.320313 13
  436.041813 3254.472168 1
  436.069332 3360.871582 1
  436.076212 6827.705078 2
  436.341219 74414.515625 24
  436.532380 680727.750000 221
  436.547885 4056.516602 1
  437.001343 2117.541992 1
  437.034130 220747.484375 72
  437.343196 12279.022461 4
  437.529831 47175.792969 15
  437.536745 19913.351563 6
  438.031570 6823.079590 2
  438.038496 5330.882324 2
  438.534173 3224.113770 1
  439.541977 34869.019531 11
  440.043695 6533.958984 2
  440.544526 3169.692383 1
  441.107452 4486.810059 1
  443.096783 1887.344604 1
  443.519905 2040.078003 1
  443.578131 2125.479004 1
  445.009158 2221.663574 1
  445.103150 83037.062500 27
  445.555795 2736.089844 1
  446.018025 2130.598145 1
  446.105219 7962.916016 3
  446.534440 5583.057129 2
  446.550481 269781.906250 88
  447.051751 60263.750000 20
  447.060679 2365.291016 1
  447.539560 2033.052124 1
  447.546713 3016.350586 1
  447.553867 6797.423828 2
  448.024585 1858.589722 1
  448.055037 4553.865723 1
  448.522958 4139.454590 1
  448.671914 1782.278198 1
  449.522201 27262.367188 9
  450.023076 12923.548828 4
  450.519370 3552.313477 1
  453.543638 20931.244141 7
  454.018358 23378.822266 8
  454.025667 2777.188477 1
  454.047596 3089.475586 1
  454.523108 21626.828125 7
  454.546903 2245.736816 1
  455.531464 13755.005859 4
  456.007470 3133.430176 1
  456.031382 12121.622070 4
  456.530281 179067.281250 58
  457.031845 37368.589844 12
  457.526841 9277.677734 3
  457.534235 5471.293457 2
  458.526668 37682.507813 12
  458.534087 3314.716797 1
  459.024096 3882.437500 1
  459.031526 7233.297363 2
  459.527916 3176.388184 1
  460.030701 6726.630859 2
  460.530579 3877.482422 1
  461.027532 164225.890625 53
  461.530909 88782.296875 29
  461.542146 1720.951050 1
  462.035110 9866.499023 3
  462.534502 3567.385254 1
  463.490479 6578.464844 2
  463.496133 3362.308594 1
  463.530061 3526.257324 1
  463.571534 2723.895996 1
  464.371917 4974.246094 2
  464.536403 4858.843262 2
  465.036068 6027.292480 2
  465.375314 3942.645020 1
  465.534642 94755.812500 31
  466.035918 22786.451172 7
  466.532295 7002.237305 2
  467.033278 3977.430664 1
  467.082848 4239.118164 1
  467.494971 5512.012695 2
  467.508336 6223.262695 2
  467.525521 1657.442993 1
  467.533158 2337.617188 1
  467.995594 4643.447754 2
  468.028105 2359.298828 1
  468.035755 2212.293945 1
  469.506138 2265.002441 1
  471.514842 4334.136719 1
  474.329632 1755.097534 1
  477.136234 1795.942017 1
  478.349236 9715.271484 3
  478.357140 2584.424316 1
  478.505387 2326.975098 1
  478.548886 2314.850098 1
  479.352704 2069.247559 1
  482.542259 2490.102539 1
  483.045194 2276.081055 1
  484.005150 2542.402832 1
  487.987739 3288.191895 1
  489.001279 1782.028442 1
  490.005687 2478.409668 1
  490.384933 3400.517090 1
  492.494162 4139.242188 1
  492.994131 2152.750000 1
  494.023318 2596.742188 1
  495.934890 1842.235474 1
  497.002603 3547.606445 1
  499.213702 1972.301147 1
  501.562628 2057.997070 1
  508.001804 8239.584961 3
  508.016943 2629.419434 1
  508.501754 2063.413086 1
  520.072964 1832.569702 1
  521.714452 2412.304199 1
  524.587092 6408.222168 2
  525.082186 2684.337402 1
  527.696398 3081.899902 1
  527.717006 557075.062500 181
  527.728455 6067.185059 2
  528.051476 241951.031250 79
  528.383971 82665.531250 27
  528.714484 18698.783203 6
  529.052202 5648.418945 2
  529.383342 2563.382324 1
  529.922107 2222.319824 1
  532.707266 2066.633301 1
  533.590862 23722.775391 8
  533.718933 12230.289063 4
  534.052134 8095.686523 3
  534.091766 9540.574219 3
  534.385646 2410.299805 1
  534.422982 1744.382202 1
  534.588705 3214.350586 1
  534.847949 1720.909058 1
  537.366076 2179.600586 1
  539.080724 2229.155762 1
  541.393200 2342.535645 1
  542.350987 3609.701172 1
  543.050677 10593.514648 3
  543.060238 3383.130859 1
  545.687212 7841.474609 3
  546.022045 4651.027832 2
  546.354773 2223.267578 1
  548.027834 4941.060059 2
  548.359973 14716.117188 5
  548.408486 6266.582520 2
  548.689986 8135.127930 3
  548.743398 4373.769043 1
  549.003288 2527.054199 1
  549.030016 2525.370605 1
  549.358202 4986.654297 2
  550.027640 2484.865723 1
  551.693136 3629.886719 1
  554.006041 1866.189819 1
  554.360887 4088.338867 1
  555.009855 7192.874023 2
  555.061723 3552.469727 1
  555.343418 6499.211914 2
  555.395333 3799.451172 1
  555.729244 3155.187500 1
  556.053549 2063.462402 1
  556.393011 4037.554688 1
  558.060132 3774.617676 1
  558.393957 3365.135254 1
  560.348086 4299.785645 1
  560.683967 6016.854980 2
  561.015129 13019.106445 4
  561.035209 3012.557617 1
  561.062820 2066.681641 1
  561.349097 9019.606445 3
  561.421957 1961.132935 1
  561.678335 4450.357910 1
  563.361707 3004.744141 1
  563.692717 5719.634277 2
  565.022216 2030.774780 1
  566.045958 3979.272949 1
  566.381883 2723.080566 1
  567.018924 7059.124023 2
  567.353163 8035.288086 3
  567.743908 7610.458984 2
  568.078788 3373.341797 1
  568.562459 5081.545898 2
  568.744314 5373.748047 2
  569.729387 2211.234375 1
  569.927222 2547.097168 1
  570.014611 4788.900391 2
  570.341211 2007.386353 1
  571.013296 3297.716309 1
  571.678823 2789.044434 1
  572.720718 3430.785645 1
  574.396804 6931.691406 2
  574.732383 5010.875488 2
  576.035862 3748.708008 1
  576.365038 2845.174316 1
  577.016383 2886.410645 1
  577.962665 2072.528320 1
  578.070285 2087.498047 1
  578.574660 3925.505859 1
  582.718548 2736.873535 1
  587.081721 3094.094727 1
  589.053456 2008.619263 1
  589.061558 1932.696411 1
  592.059668 2268.464355 1
  593.367964 2308.281738 1
  594.732649 1847.872192 1
  595.371480 2309.129883 1
  601.897674 1894.170532 1
  604.814592 1660.567505 1
  604.820211 1642.537720 1
  607.040230 2846.660156 1
  610.954784 4220.960938 1
  613.205827 1806.119751 1
  620.448421 2215.581543 1
  632.309932 2001.122681 1
  635.711267 2057.022461 1
  637.692860 2259.154297 1
  640.041427 8819.556641 3
  642.224654 1772.453979 1
  643.502338 1785.572388 1
  652.031490 1934.168579 1
  654.074141 2405.259277 1
  662.219157 2213.925293 1
  676.476256 2002.988892 1
  681.243731 2024.453735 1
  684.026385 1975.078247 1
  685.583444 2439.363281 1
  706.059791 2028.482056 1
  715.324681 1743.411743 1
  744.079379 3027.502441 1
  768.120902 42435.292969 14
  769.123129 10395.964844 3
  769.707658 2144.407227 1
  772.729580 2215.184082 1
  790.144439 1765.376343 1
  791.072404 357725.656250 116
  791.097620 2470.843750 1
  791.572755 155111.390625 50
  792.073580 45913.335938 15
  792.570667 18469.408203 6
  793.076659 5423.734375 2
  793.578912 3271.113281 1
  797.422741 32945.031250 11
  797.758861 28724.435547 9
  798.090935 20884.052734 7
  798.423216 12122.181641 4
  798.759969 7899.637695 3
  799.092669 3164.544434 1
  800.079191 25133.404297 8
  800.515380 2502.921875 1
  800.579556 10780.227539 4
  801.050412 2069.472656 1
  801.084672 3277.285156 1
  801.106086 3632.762207 1
  801.581693 3486.744141 1
  802.757530 2040.294800 1
  803.423839 3589.178711 1
  803.552898 2603.157715 1
  805.255078 1911.748413 1
  805.410482 4640.098633 2
  805.751666 2585.888184 1
  806.045517 2125.787598 1
  809.736607 1856.436401 1
  810.054414 7456.461426 2
  810.093609 5232.225586 2
  810.106674 6397.290039 2
  810.132806 1505489.500000 489
  810.154584 8809.350586 3
  810.167651 5947.668945 2
  810.555449 1717.952515 1
  810.633914 4907.918945 2
  810.747272 1894.658813 1
  811.056949 3781.831055 1
  811.135487 341028.468750 111
  811.401727 2114.347168 1
  811.585116 5528.337402 2
  811.729252 2348.501465 1
  812.087572 13353.246094 4
  812.122543 22302.646484 7
  812.140029 42647.152344 14
  812.393643 3183.518555 1
  812.415512 4771.635742 2
  812.756781 4620.485840 2
  813.093885 5509.048828 2
  813.128921 7813.897461 3
  813.142060 7798.935547 3
  813.755568 2042.230835 1
  814.071357 13642.352539 4
  814.576124 10706.363281 3
  815.270396 2030.673462 1
  815.397922 2054.822754 1
  815.582668 2531.503418 1
  815.732270 2365.700684 1
  816.758593 12965.252930 4
  817.093779 9711.091797 3
  817.424756 4537.278809 1
  817.760352 2334.972656 1
  818.065216 10585.194336 3
  818.401206 5294.486816 2
  818.454276 2604.573242 1
  820.088702 3117.401367 1
  821.123261 8190.666992 3
  821.536743 3025.635742 1
  821.625705 5586.817871 2
  822.035115 3873.451660 1
  822.110800 31439.775391 10
  822.614151 20807.468750 7
  823.082280 1908.484253 1
  823.117964 2581.945313 1
  823.742799 1639.234985 1
  825.070701 2470.008301 1
  827.398896 1932.425903 1
  828.042115 2279.081055 1
  829.051184 2526.528809 1
  830.062098 3020.632324 1
  830.396467 2802.762695 1
  831.387203 2819.002441 1
  832.016947 2880.665039 1
  832.089481 11807.049805 4
  832.112150 10238.322266 3
  832.588412 5835.614746 2
  832.733640 3154.145996 1
  833.087791 5959.886230 2
  833.605805 2038.332642 1
  833.783131 3113.762695 1
  834.092450 36362.207031 12
  834.734381 2865.895508 1
  835.094368 7196.786133 2
  835.431783 2391.440430 1
  835.591442 2225.168945 1
  836.093526 2613.290039 1
  836.586922 13800.249023 4
  837.094479 9759.349609 3
  837.584182 4824.779785 2
  838.069733 4837.382813 2
  838.092647 2684.517090 1
  838.124728 3879.914551 1
  838.587813 2493.392090 1
  839.074237 2388.913086 1
  840.526845 2962.010742 1
  841.024171 5329.262207 2
  841.097887 10364.737305 3
  841.521939 2453.380371 1
  841.591108 7987.285156 3
  842.103226 2570.868164 1
  842.449517 1818.136597 1
  843.114993 3542.370605 1
  843.619246 2880.613770 1
  843.739594 2371.415527 1
  844.072998 3047.247559 1
  844.105423 6935.225586 2
  844.610565 2859.555176 1
  844.740400 2243.340332 1
  845.037277 6115.018066 2
  846.035745 2365.228516 1
  848.565350 2666.418945 1
  849.088522 2219.844727 1
  849.724452 2433.978027 1
  850.028642 3395.191406 1
  850.061410 2360.785645 1
  850.126953 5091.087402 2
  850.628139 6272.037598 2
  851.012525 1650.629761 1
  851.115698 18906.310547 6
  851.613064 10407.552734 3
  852.077979 3291.627441 1
  852.115565 8194.366211 3
  853.074836 3106.574707 1
  854.045158 13961.336914 5
  854.082873 8845.324219 3
  854.120592 223978.687500 73
  854.582843 4755.163574 2
  855.040748 2977.253418 1
  855.083252 2182.230957 1
  855.125760 47999.050781 16
  855.517926 2357.539063 1
  856.127972 8978.959961 3
  856.639211 1869.713257 1
  857.131947 2991.826660 1
  858.085461 1898.683228 1
  858.579446 6400.548340 2
  858.607959 3358.478516 1
  859.083370 4811.352539 2
  859.111908 1958.062378 1
  860.083021 2896.350586 1
  860.597807 3512.573242 1
  861.093964 12428.786133 4
  861.595326 6785.374512 2
  862.097127 7609.847656 2
  863.039784 15487.416992 5
  863.087676 3838.192383 1
  863.547641 2729.489746 1
  863.590781 1750.922241 1
  863.605162 1750.443970 1
  864.022364 3127.578613 1
  864.051148 8369.775391 3
  865.025845 4610.229004 1
  865.588366 10127.432617 3
  866.059960 1878.814331 1
  866.093660 7713.136719 3
  867.095929 3568.233887 1
  868.090278 3738.386719 1
  868.109602 5497.446777 2
  868.138591 784170.562500 255
  868.167580 4890.248047 2
  868.182076 3507.369141 1
  868.554248 2615.021484 1
  869.139573 163025.093750 53
  869.599541 3044.341309 1
  870.098656 7945.954102 3
  870.142288 25962.201172 8
  870.598200 4115.385742 1
  871.093319 3838.075684 1
  871.137026 7885.351563 3
  872.060503 13948.390625 5
  872.556869 2232.577637 1
  873.063405 2233.913086 1
  873.102388 3107.500977 1
  873.604522 2655.870605 1
  874.063158 1870.494995 1
  876.107006 3021.821777 1
  877.107086 2245.092285 1
  878.079391 4063.451172 1
  879.127161 2434.456055 1
  883.089158 3633.314453 1
  883.594971 2394.760254 1
  884.448897 2246.472168 1
  890.114979 4975.735840 2
  892.094620 13981.410156 5
  893.097000 6550.844727 2
  895.091661 4170.006836 1
  898.042828 6084.539551 2
  907.495427 1886.278442 1
  912.056636 12891.785156 4
  913.056378 9911.268555 3
  921.045188 4783.979492 2
  922.054461 3694.154297 1
  951.079111 2013.185425 1
  986.703327 2061.817383 1
  1045.757910 1889.291626 1
  1064.367261 2359.618652 1
  1067.133961 4841.263184 2
  1067.805902 2390.543457 1
  1094.453227 2200.329590 1
  1096.768478 2088.224121 1
  1108.100255 3162.878906 1
  1110.403053 2278.878418 1
  1130.442290 2887.325195 1
  1163.334156 1947.703491 1
  1188.753054 2492.911621 1
  1195.634160 6451.745117 2
  1196.141906 5567.368652 2
  1196.642156 3390.846680 1
  1197.142720 3404.779297 1
  1221.987792 6403.077637 2
  1224.638592 2734.012695 1
  1225.132528 2581.248535 1
  1237.192269 1967.129028 1
  1237.693819 1890.455933 1
  1243.703151 2321.950195 1
  1244.697901 2536.204102 1
  1245.652323 2290.192871 1
  1250.758377 1991.089722 1
  1256.896891 2075.627441 1
  1260.084487 2086.522461 1
  1272.622408 1986.856812 1
  1281.579086 2584.511230 1
  1291.103709 1930.807007 1
  1293.657441 1782.536011 1
  1314.479889 2010.849487 1
  1321.992409 6193.257324 2
  1322.991670 3328.085449 1
  1369.263353 2105.061035 1
  1369.876060 1925.381714 1
  1391.131687 2049.815430 1
  1414.823930 2212.099609 1
  1421.977781 3612.870117 1
  1430.482996 1781.134644 1
  1470.153471 1892.857788 1
  1486.158146 1973.864624 1
  1488.357384 2045.286743 1