ACCESSION: MSBNK-NAIST-KNA00089
RECORD_TITLE: L-(-)-Phenylalanine; LC-ESI-ITFT; MS; POS
DATE: 2016.01.19 (Created 2009.11.17, modified 2011.08.03)
AUTHORS: Takahashi H, Kanaya S, Ogasawara N, Graduate School of Information Science, NAIST
LICENSE: CC BY-SA

CH$NAME: L-Phenylalanine
CH$NAME: (S)-alpha-Amino-beta-phenylpropionic acid
CH$NAME: L-(-)-Phenylalanine
CH$COMPOUND_CLASS: Natural Product
CH$FORMULA: C9H11NO2
CH$EXACT_MASS: 165.07898
CH$SMILES: C1=CC=C(C=C1)C[C@@H](C(=O)O)N
CH$IUPAC: InChI=1S/C9H11NO2/c10-8(9(11)12)6-7-4-2-1-3-5-7/h1-5,8H,6,10H2,(H,11,12)/t8-/m0/s1
CH$LINK: CAS 63-91-2
CH$LINK: CHEBI 17295
CH$LINK: KEGG C00079
CH$LINK: KNAPSACK C00001386
CH$LINK: NIKKAJI J9.175H
CH$LINK: PUBCHEM CID:6140
CH$LINK: INCHIKEY COLNVLDHVKWLRT-QMMMGPOBSA-N
CH$LINK: COMPTOX DTXSID4040763

AC$INSTRUMENT: LTQ Orbitrap XL, Thermo Scientfic
AC$INSTRUMENT_TYPE: LC-ESI-ITFT
AC$MASS_SPECTROMETRY: MS_TYPE MS
AC$MASS_SPECTROMETRY: ION_MODE POSITIVE
AC$MASS_SPECTROMETRY: COLLISION_ENERGY 35eV
AC$MASS_SPECTROMETRY: IONIZATION ESI
AC$CHROMATOGRAPHY: COLUMN_NAME TOSOH TSKgel ODS-100V 5um Part no. 21456
AC$CHROMATOGRAPHY: FLOW_GRADIENT 0min:3%, 45min:97%, 50min:97%, 50.1:3%, 57min:3% (acetonitrile)
AC$CHROMATOGRAPHY: FLOW_RATE 0.5 ml/min
AC$CHROMATOGRAPHY: RETENTION_TIME 11.703148 min
AC$CHROMATOGRAPHY: SOLVENT A 0.1%formate-water
AC$CHROMATOGRAPHY: SOLVENT B 0.1%formate-acetonitrile

MS$FOCUSED_ION: BASE_PEAK 166.086243

PK$SPLASH: splash10-014i-0900000000-5f5b13d6becdc1eeedc2
PK$NUM_PEAK: 102
PK$PEAK: m/z int. rel.int.
  100.112037 123323.484375 2
  102.033748 153921.281250 3
  103.054040 149419.921875 3
  107.049072 56103.718750 1
  110.019964 258261.750000 5
  111.020036 66744.554688 1
  120.076558 41211.519531 1
  120.078795 66201.007813 1
  120.080783 6912783.000000 125
  120.082274 47965.898438 1
  120.083020 65040.402344 1
  120.084511 45321.425781 1
  121.083942 476118.937500 9
  131.048840 103598.773438 2
  137.132609 32978.554688 1
  138.091257 27838.195313 1
  149.023248 119411.625000 2
  149.059678 214892.703125 4
  154.990433 45669.457031 1
  155.142891 31110.865234 1
  158.002927 121582.648438 2
  158.096379 42918.281250 1
  158.961625 87188.093750 2
  163.133459 85189.789063 2
  165.467218 50286.796875 1
  165.881689 54702.933594 1
  165.974544 77565.492188 1
  166.017768 55236.359375 1
  166.048884 147497.484375 3
  166.050500 28532.525391 1
  166.052925 31001.224609 1
  166.054138 28068.779297 1
  166.058180 37088.816406 1
  166.061817 39041.800781 1
  166.065455 41338.718750 1
  166.067476 53862.945313 1
  166.069093 50184.296875 1
  166.070306 58989.035156 1
  166.072731 51138.535156 1
  166.074348 78005.531250 1
  166.076774 193478.562500 4
  166.078391 122077.679688 2
  166.079604 266521.500000 5
  166.082838 526700.000000 10
  166.084051 180307.781250 3
  166.086072 55047952.000000 999
  166.088902 387125.750000 7
  166.090115 466941.312500 8
  166.092541 355969.156250 6
  166.094967 184682.453125 3
  166.096180 122700.429688 2
  166.097393 83432.210938 2
  166.099010 46342.539063 1
  166.100628 31809.464844 1
  166.101436 31635.511719 1
  166.103054 61743.144531 1
  166.104671 64229.675781 1
  166.106289 36573.355469 1
  166.107906 37275.089844 1
  166.110332 44989.804688 1
  166.111546 31461.812500 1
  166.114376 36984.449219 1
  166.118016 32335.652344 1
  166.119229 32521.519531 1
  166.123678 156683.687500 3
  166.154419 50923.542969 1
  166.197713 80203.546875 1
  166.291238 63765.972656 1
  166.708811 45775.324219 1
  167.083077 47183.035156 1
  167.085933 50324.691406 1
  167.089196 5557565.500000 101
  167.092868 41859.625000 1
  167.095724 30918.984375 1
  168.089498 85780.656250 2
  168.091556 74116.054688 1
  171.148702 1208511.250000 22
  172.152025 71425.015625 1
  174.127584 573771.187500 10
  175.130548 37839.398438 1
  179.063200 98872.257813 2
  182.984796 178030.953125 3
  186.955984 76297.007813 1
  187.126060 252249.296875 5
  190.085898 46204.746094 1
  190.992536 88934.843750 2
  195.122110 63892.210938 1
  199.179842 180823.296875 3
  217.104082 104475.218750 2
  233.173966 32342.347656 1
  279.157671 36575.109375 1
  282.220291 32435.894531 1
  299.181639 30387.068359 1
  328.211336 48176.199219 1
  360.200177 28811.322266 1
  391.284356 1540724.875000 28
  392.286254 234410.343750 4
  413.263556 99495.921875 2
  436.341219 132494.375000 2
  437.343196 32541.019531 1
  556.363265 537080.812500 10
  557.366039 138787.078125 3