ACCESSION: MSBNK-GL_Sciences_Inc-GLS00136
RECORD_TITLE: 2-Hydroxypyridine; EI-B; MS; n TMS; RT: 284.99 s
DATE: 2016.01.19 (Created 2012.08.03, modified 2013.07.31)
AUTHORS: Miyagawa H, Akimoto S, Yamasaki K, GL Sciences Inc.
LICENSE: CC BY-SA
COPYRIGHT: GLS
COMMENT: The chemical compound was chemically modified with N-methyl-N-trimethylsilyl-trifluoroacetamide(MSTFA) before GC-MS analysis. When it has two or more functional groups, this modification gave a mixture of the TMS derivatives having different number of TMS groups at different functional groups.

CH$NAME: 2-Hydroxypyridine
CH$COMPOUND_CLASS: Natural Product
CH$FORMULA: C5H5NO
CH$EXACT_MASS: 95.03711
CH$SMILES: Oc(c1)nccc1
CH$IUPAC: InChI=1S/C5H5NO/c7-5-3-1-2-4-6-5/h1-4H,(H,6,7)
CH$LINK: CAS 142-08-5
CH$LINK: CHEBI 16540
CH$LINK: KEGG C02502
CH$LINK: PUBCHEM 5514
CH$LINK: INCHIKEY UBQKCCHYAOITMY-UHFFFAOYSA-N
CH$LINK: COMPTOX DTXSID2051716

AC$INSTRUMENT: GCMS-2010 Plus, Shimadzu
AC$INSTRUMENT_TYPE: EI-B
AC$MASS_SPECTROMETRY: MS_TYPE MS
AC$MASS_SPECTROMETRY: ION_MODE POSITIVE
AC$MASS_SPECTROMETRY: GAS_PRESSURE 75 kPa
AC$MASS_SPECTROMETRY: ION_SOURCE_TEMPERATURE 200 C
AC$MASS_SPECTROMETRY: SCAN_RANGE_M/Z 85-500
AC$CHROMATOGRAPHY: COLUMN_NAME InertCap 5MS/NP 0.25 mmI.D. x 30 m, df=0.25 um
AC$CHROMATOGRAPHY: INJECTION_TEMPERATURE 230 C
AC$CHROMATOGRAPHY: OVEN_TEMPERATURE 80 C(2 min)-15 C/min - 330C
AC$CHROMATOGRAPHY: RETENTION_INDEX 1038
AC$CHROMATOGRAPHY: RETENTION_TIME 284.99
AC$CHROMATOGRAPHY: TRANSFARLINE_TEMPERATURE 250 C

MS$FOCUSED_ION: DERIVATIVE_TYPE n TMS
MS$DATA_PROCESSING: WHOLE GCMSsolution

PK$SPLASH: splash10-0udi-0900000000-1fea7566ea893b73b6e3
PK$NUM_PEAK: 338
PK$PEAK: m/z int. rel.int.
  86.050000 1660.000000 4
  87.000000 270.000000 1
  88.000000 106.000000 1
  89.000000 100.000000 1
  90.000000 121.000000 1
  91.050000 920.000000 2
  92.050000 8297.000000 18
  93.050000 5859.000000 12
  94.000000 1999.000000 4
  95.050000 7331.000000 16
  96.050000 5509.000000 12
  97.050000 20088.000000 43
  98.050000 6179.000000 13
  99.050000 5158.000000 11
  100.050000 2205.000000 5
  101.000000 327.000000 1
  102.000000 135.000000 1
  103.000000 24.000000 1
  104.000000 138.000000 1
  105.000000 183.000000 1
  106.000000 3004.000000 6
  107.000000 535.000000 1
  108.050000 2063.000000 4
  109.000000 1462.000000 3
  110.050000 1265.000000 3
  111.000000 634.000000 1
  112.000000 190.000000 1
  113.000000 81.000000 1
  114.000000 124.000000 1
  115.000000 66.000000 1
  118.000000 78.000000 1
  119.000000 24.000000 1
  120.000000 162.000000 1
  121.000000 230.000000 1
  122.000000 39468.000000 84
  123.000000 4457.000000 9
  124.000000 3406.000000 7
  125.000000 938.000000 2
  126.000000 556.000000 1
  127.000000 111.000000 1
  129.000000 36.000000 1
  130.000000 65.000000 1
  131.000000 178.000000 1
  132.000000 780.000000 2
  133.000000 161.000000 1
  134.100000 1266.000000 3
  134.950000 861.000000 2
  136.050000 15165.000000 32
  137.000000 7775.000000 16
  138.050000 3679.000000 8
  139.000000 838.000000 2
  140.000000 167.000000 1
  141.000000 39.000000 1
  142.000000 81.000000 1
  143.000000 70.000000 1
  146.000000 65.000000 1
  147.000000 92.000000 1
  148.000000 1023.000000 2
  149.000000 252.000000 1
  150.000000 540.000000 1
  151.150000 2803.000000 6
  152.100000 470764.000000 999
  153.100000 63071.000000 134
  154.050000 21148.000000 45
  155.100000 1857.000000 4
  156.100000 81.000000 1
  157.100000 46.000000 1
  158.100000 11.000000 1
  159.100000 55.000000 1
  160.100000 39.000000 1
  161.100000 21.000000 1
  162.100000 100.000000 1
  163.100000 19.000000 1
  164.100000 167.000000 1
  165.100000 369.000000 1
  166.050000 68735.000000 146
  167.050000 52876.000000 112
  168.050000 9627.000000 20
  169.100000 2210.000000 5
  170.100000 167.000000 1
  172.100000 50.000000 1
  173.100000 21.000000 1
  174.100000 39.000000 1
  175.100000 29.000000 1
  176.100000 54.000000 1
  177.100000 55.000000 1
  178.100000 57.000000 1
  179.100000 110.000000 1
  181.100000 2.000000 1
  182.100000 21.000000 1
  184.100000 39.000000 1
  185.100000 79.000000 1
  186.100000 21.000000 1
  187.100000 6.000000 1
  188.100000 8.000000 1
  189.100000 81.000000 1
  190.100000 100.000000 1
  191.100000 13.000000 1
  192.100000 26.000000 1
  193.100000 21.000000 1
  194.100000 70.000000 1
  195.100000 50.000000 1
  196.100000 11.000000 1
  197.100000 14.000000 1
  198.100000 55.000000 1
  199.100000 38.000000 1
  200.100000 68.000000 1
  201.100000 6.000000 1
  202.100000 27.000000 1
  203.100000 44.000000 1
  205.100000 95.000000 1
  206.100000 119.000000 1
  207.100000 95.000000 1
  208.100000 55.000000 1
  209.100000 79.000000 1
  210.100000 14.000000 1
  212.100000 52.000000 1
  213.100000 29.000000 1
  214.100000 42.000000 1
  215.100000 22.000000 1
  216.100000 14.000000 1
  218.100000 39.000000 1
  219.100000 202.000000 1
  220.100000 54.000000 1
  221.100000 63.000000 1
  222.100000 84.000000 1
  224.100000 71.000000 1
  225.100000 27.000000 1
  226.100000 46.000000 1
  227.100000 18.000000 1
  228.100000 63.000000 1
  229.100000 62.000000 1
  230.100000 44.000000 1
  232.100000 38.000000 1
  234.100000 31.000000 1
  235.100000 86.000000 1
  236.100000 19.000000 1
  237.100000 60.000000 1
  238.100000 34.000000 1
  239.100000 98.000000 1
  241.100000 8.000000 1
  243.100000 8.000000 1
  245.100000 130.000000 1
  246.100000 42.000000 1
  247.100000 14.000000 1
  248.100000 97.000000 1
  249.100000 33.000000 1
  251.100000 41.000000 1
  252.100000 39.000000 1
  253.100000 198.000000 1
  254.100000 26.000000 1
  255.100000 38.000000 1
  257.100000 54.000000 1
  258.100000 100.000000 1
  259.100000 10.000000 1
  261.100000 26.000000 1
  263.100000 134.000000 1
  264.100000 68.000000 1
  265.100000 31.000000 1
  266.100000 3.000000 1
  267.100000 84.000000 1
  268.100000 97.000000 1
  269.100000 16.000000 1
  270.100000 3.000000 1
  271.100000 6.000000 1
  272.100000 33.000000 1
  273.100000 42.000000 1
  274.100000 60.000000 1
  275.100000 34.000000 1
  276.100000 54.000000 1
  277.100000 39.000000 1
  278.100000 66.000000 1
  279.100000 132.000000 1
  280.100000 54.000000 1
  281.100000 105.000000 1
  282.100000 49.000000 1
  284.100000 39.000000 1
  285.100000 29.000000 1
  286.100000 74.000000 1
  287.100000 21.000000 1
  288.100000 55.000000 1
  289.100000 19.000000 1
  290.100000 29.000000 1
  291.100000 86.000000 1
  292.100000 31.000000 1
  293.100000 81.000000 1
  296.100000 63.000000 1
  297.100000 62.000000 1
  298.100000 16.000000 1
  301.100000 65.000000 1
  302.100000 82.000000 1
  303.100000 65.000000 1
  304.100000 50.000000 1
  306.100000 66.000000 1
  308.100000 18.000000 1
  309.100000 11.000000 1
  313.100000 62.000000 1
  314.100000 33.000000 1
  315.100000 11.000000 1
  316.100000 74.000000 1
  317.100000 58.000000 1
  318.100000 106.000000 1
  319.100000 55.000000 1
  322.100000 30.000000 1
  325.100000 33.000000 1
  326.100000 38.000000 1
  327.100000 97.000000 1
  328.100000 41.000000 1
  329.100000 39.000000 1
  331.100000 63.000000 1
  332.100000 29.000000 1
  333.100000 14.000000 1
  335.100000 68.000000 1
  337.100000 18.000000 1
  338.100000 62.000000 1
  339.100000 70.000000 1
  341.100000 119.000000 1
  342.100000 49.000000 1
  343.100000 94.000000 1
  344.100000 70.000000 1
  345.100000 18.000000 1
  346.100000 79.000000 1
  347.100000 70.000000 1
  348.100000 66.000000 1
  350.100000 74.000000 1
  351.100000 95.000000 1
  352.100000 90.000000 1
  353.100000 84.000000 1
  354.100000 71.000000 1
  355.100000 90.000000 1
  356.100000 73.000000 1
  357.100000 8.000000 1
  358.100000 73.000000 1
  359.100000 36.000000 1
  361.100000 50.000000 1
  362.100000 6.000000 1
  363.100000 14.000000 1
  365.100000 82.000000 1
  366.100000 6.000000 1
  367.100000 71.000000 1
  368.100000 16.000000 1
  370.100000 54.000000 1
  371.100000 47.000000 1
  372.100000 44.000000 1
  373.100000 42.000000 1
  375.100000 18.000000 1
  377.100000 102.000000 1
  378.100000 57.000000 1
  380.100000 106.000000 1
  384.100000 27.000000 1
  385.100000 54.000000 1
  386.100000 98.000000 1
  387.100000 21.000000 1
  388.100000 47.000000 1
  389.100000 11.000000 1
  390.100000 30.000000 1
  391.100000 87.000000 1
  392.100000 116.000000 1
  394.100000 74.000000 1
  395.100000 65.000000 1
  396.100000 31.000000 1
  397.100000 27.000000 1
  398.100000 39.000000 1
  399.100000 13.000000 1
  400.100000 34.000000 1
  401.100000 68.000000 1
  402.100000 54.000000 1
  403.100000 60.000000 1
  405.100000 103.000000 1
  407.100000 76.000000 1
  408.100000 68.000000 1
  409.100000 49.000000 1
  410.100000 57.000000 1
  411.100000 89.000000 1
  412.100000 21.000000 1
  413.100000 47.000000 1
  416.100000 38.000000 1
  417.100000 71.000000 1
  418.100000 30.000000 1
  420.100000 113.000000 1
  421.100000 57.000000 1
  422.100000 31.000000 1
  423.100000 18.000000 1
  424.100000 100.000000 1
  425.100000 24.000000 1
  426.100000 132.000000 1
  427.100000 57.000000 1
  428.100000 24.000000 1
  430.100000 92.000000 1
  432.100000 26.000000 1
  433.100000 8.000000 1
  435.100000 21.000000 1
  437.100000 60.000000 1
  438.100000 8.000000 1
  439.100000 36.000000 1
  441.100000 74.000000 1
  442.100000 135.000000 1
  443.100000 74.000000 1
  444.100000 26.000000 1
  445.100000 130.000000 1
  446.100000 42.000000 1
  447.100000 74.000000 1
  449.100000 21.000000 1
  452.100000 13.000000 1
  453.100000 11.000000 1
  454.100000 63.000000 1
  455.100000 78.000000 1
  456.100000 65.000000 1
  457.100000 78.000000 1
  458.100000 90.000000 1
  460.100000 3.000000 1
  461.100000 16.000000 1
  463.100000 18.000000 1
  464.100000 26.000000 1
  465.100000 46.000000 1
  466.100000 84.000000 1
  467.100000 97.000000 1
  468.100000 63.000000 1
  470.100000 70.000000 1
  471.100000 46.000000 1
  472.100000 36.000000 1
  475.100000 68.000000 1
  476.100000 50.000000 1
  477.100000 39.000000 1
  478.100000 50.000000 1
  481.100000 76.000000 1
  482.100000 122.000000 1
  484.100000 19.000000 1
  486.100000 38.000000 1
  487.100000 63.000000 1
  488.100000 73.000000 1
  489.100000 50.000000 1
  492.100000 41.000000 1
  494.100000 26.000000 1
  495.100000 29.000000 1
  496.100000 38.000000 1
  497.100000 47.000000 1
  499.100000 29.000000 1