ACCESSION: MSBNK-GL_Sciences_Inc-GLS00035
RECORD_TITLE: DL-Norvaline; EI-B; MS; 2 TMS; RT: 430.04 s
DATE: 2016.01.19 (Created 2012.08.03, modified 2013.07.31)
AUTHORS: Miyagawa H, Akimoto S, Yamasaki K, GL Sciences Inc.
LICENSE: CC BY-SA
COPYRIGHT: GL Sciences Inc.
COMMENT: The chemical compound was chemically modified with N-methyl-N-trimethylsilyl-trifluoroacetamide(MSTFA) before GC-MS analysis. When it has two or more functional groups, this modification gave a mixture of the TMS derivatives having different number of TMS groups at different functional groups.

CH$NAME: DL-Norvaline
CH$COMPOUND_CLASS: Natural Product
CH$FORMULA: C5H11NO2
CH$EXACT_MASS: 117.07898
CH$SMILES: CC(C)C(N)C(O)=O
CH$IUPAC: InChI=1S/C5H11NO2/c1-3(2)4(6)5(7)8/h3-4H,6H2,1-2H3,(H,7,8)
CH$LINK: CAS 760-78-1
CH$LINK: INCHIKEY KZSNJWFQEVHDMF-UHFFFAOYSA-N
CH$LINK: COMPTOX DTXSID70859522

AC$INSTRUMENT: GCMS-2010 Plus, Shimadzu
AC$INSTRUMENT_TYPE: EI-B
AC$MASS_SPECTROMETRY: MS_TYPE MS
AC$MASS_SPECTROMETRY: ION_MODE POSITIVE
AC$MASS_SPECTROMETRY: GAS_PRESSURE 75 kPa
AC$MASS_SPECTROMETRY: ION_SOURCE_TEMPERATURE 200 C
AC$MASS_SPECTROMETRY: SCAN_RANGE_M/Z 85-500
AC$CHROMATOGRAPHY: COLUMN_NAME InertCap 5MS/NP 0.25 mmI.D. x 30 m, df=0.25 um
AC$CHROMATOGRAPHY: INJECTION_TEMPERATURE 230 C
AC$CHROMATOGRAPHY: OVEN_TEMPERATURE 80 C(2 min)-15 C/min - 330C
AC$CHROMATOGRAPHY: RETENTION_INDEX 1248
AC$CHROMATOGRAPHY: RETENTION_TIME 430.04
AC$CHROMATOGRAPHY: TRANSFARLINE_TEMPERATURE 250 C

MS$FOCUSED_ION: DERIVATIVE_TYPE 2 TMS
MS$DATA_PROCESSING: WHOLE GCMSsolution

PK$SPLASH: splash10-0006-0900000000-9f6f7592904a13db650f
PK$NUM_PEAK: 355
PK$PEAK: m/z int. rel.int.
  86.050000 2630.000000 5
  87.050000 1382.000000 2
  88.100000 585.000000 1
  89.100000 465.000000 1
  90.100000 214.000000 1
  91.100000 316.000000 1
  92.100000 153.000000 1
  92.800000 178.000000 1
  93.800000 1647.000000 3
  94.750000 852.000000 2
  95.800000 257.000000 1
  96.800000 311.000000 1
  97.800000 620.000000 1
  99.150000 1236.000000 2
  100.050000 17549.000000 31
  101.100000 3574.000000 6
  102.100000 6450.000000 12
  103.050000 7316.000000 13
  104.100000 770.000000 1
  105.050000 1595.000000 3
  106.000000 246.000000 1
  107.000000 254.000000 1
  108.000000 404.000000 1
  109.000000 98.000000 1
  110.000000 220.000000 1
  111.000000 142.000000 1
  112.000000 825.000000 1
  113.000000 612.000000 1
  114.100000 3494.000000 6
  115.150000 5280.000000 9
  116.050000 2126.000000 4
  117.100000 3094.000000 6
  118.100000 623.000000 1
  119.100000 1319.000000 2
  120.100000 207.000000 1
  121.100000 126.000000 1
  122.100000 22.000000 1
  123.100000 98.000000 1
  124.100000 81.000000 1
  125.100000 108.000000 1
  126.100000 569.000000 1
  127.100000 228.000000 1
  128.100000 6862.000000 12
  129.150000 3012.000000 5
  130.100000 1938.000000 3
  131.050000 4777.000000 9
  132.050000 3329.000000 6
  133.050000 7662.000000 14
  134.100000 1252.000000 2
  135.100000 761.000000 1
  136.100000 68.000000 1
  137.100000 44.000000 1
  138.100000 46.000000 1
  139.100000 22.000000 1
  140.100000 127.000000 1
  141.100000 231.000000 1
  142.150000 2851.000000 5
  143.250000 3678.000000 7
  144.150000 558300.000000 999
  145.200000 73977.000000 132
  146.150000 23619.000000 42
  147.100000 53802.000000 96
  148.100000 8326.000000 15
  149.150000 4639.000000 8
  150.100000 540.000000 1
  151.100000 175.000000 1
  152.100000 78.000000 1
  153.100000 52.000000 1
  154.100000 126.000000 1
  155.100000 151.000000 1
  156.100000 7367.000000 13
  157.100000 1814.000000 3
  158.050000 1497.000000 3
  159.000000 618.000000 1
  160.000000 442.000000 1
  161.000000 223.000000 1
  162.000000 94.000000 1
  163.000000 481.000000 1
  164.000000 172.000000 1
  165.000000 170.000000 1
  166.000000 52.000000 1
  168.000000 26.000000 1
  169.000000 30.000000 1
  170.000000 97.000000 1
  171.000000 54.000000 1
  172.000000 774.000000 1
  173.000000 274.000000 1
  174.050000 1466.000000 3
  175.100000 503.000000 1
  176.100000 342.000000 1
  177.100000 282.000000 1
  178.100000 71.000000 1
  179.100000 106.000000 1
  180.100000 19.000000 1
  181.100000 140.000000 1
  183.100000 78.000000 1
  184.100000 95.000000 1
  185.100000 44.000000 1
  186.100000 180.000000 1
  187.100000 16.000000 1
  188.100000 140.000000 1
  189.100000 154.000000 1
  190.100000 191.000000 1
  191.100000 166.000000 1
  192.100000 82.000000 1
  193.100000 66.000000 1
  194.100000 79.000000 1
  195.100000 186.000000 1
  196.100000 26.000000 1
  198.100000 14.000000 1
  199.100000 70.000000 1
  200.100000 47.000000 1
  201.100000 100.000000 1
  202.100000 1070.000000 2
  203.100000 612.000000 1
  204.100000 466.000000 1
  205.100000 151.000000 1
  206.100000 81.000000 1
  207.100000 279.000000 1
  208.100000 102.000000 1
  209.100000 81.000000 1
  211.100000 21.000000 1
  212.100000 21.000000 1
  214.100000 76.000000 1
  215.100000 129.000000 1
  216.100000 500.000000 1
  217.100000 354.000000 1
  218.050000 36640.000000 66
  219.050000 10810.000000 19
  220.100000 3879.000000 7
  221.100000 545.000000 1
  222.100000 231.000000 1
  223.100000 81.000000 1
  224.100000 76.000000 1
  225.100000 102.000000 1
  226.100000 22.000000 1
  227.100000 6.000000 1
  228.100000 294.000000 1
  229.100000 14.000000 1
  230.100000 172.000000 1
  231.100000 119.000000 1
  232.100000 276.000000 1
  233.100000 79.000000 1
  234.100000 19.000000 1
  235.100000 78.000000 1
  236.100000 6.000000 1
  237.100000 10.000000 1
  238.100000 31.000000 1
  239.100000 84.000000 1
  240.100000 6.000000 1
  241.100000 54.000000 1
  242.100000 42.000000 1
  243.100000 71.000000 1
  244.100000 290.000000 1
  245.100000 94.000000 1
  246.100000 6818.000000 12
  247.100000 1654.000000 3
  248.100000 532.000000 1
  249.100000 119.000000 1
  250.100000 68.000000 1
  251.100000 16.000000 1
  252.100000 82.000000 1
  253.100000 854.000000 2
  254.100000 180.000000 1
  255.100000 151.000000 1
  256.100000 31.000000 1
  257.100000 10.000000 1
  258.100000 19.000000 1
  259.100000 14.000000 1
  260.100000 71.000000 1
  261.100000 276.000000 1
  262.100000 66.000000 1
  263.100000 30.000000 1
  264.100000 170.000000 1
  265.100000 57.000000 1
  266.100000 55.000000 1
  268.100000 57.000000 1
  269.100000 156.000000 1
  270.100000 54.000000 1
  271.100000 62.000000 1
  272.100000 65.000000 1
  273.100000 87.000000 1
  274.100000 2.000000 1
  275.100000 58.000000 1
  276.100000 34.000000 1
  277.100000 65.000000 1
  278.100000 29.000000 1
  279.100000 5.000000 1
  280.100000 24.000000 1
  281.100000 102.000000 1
  282.100000 22.000000 1
  283.100000 87.000000 1
  284.100000 38.000000 1
  286.100000 24.000000 1
  287.100000 41.000000 1
  288.100000 52.000000 1
  290.100000 82.000000 1
  291.100000 44.000000 1
  292.100000 39.000000 1
  294.100000 73.000000 1
  295.100000 24.000000 1
  296.100000 97.000000 1
  298.100000 41.000000 1
  299.100000 33.000000 1
  301.100000 31.000000 1
  302.100000 5.000000 1
  303.100000 150.000000 1
  304.100000 121.000000 1
  305.100000 65.000000 1
  307.100000 74.000000 1
  308.100000 44.000000 1
  309.100000 41.000000 1
  311.100000 42.000000 1
  312.100000 2.000000 1
  313.100000 76.000000 1
  315.100000 68.000000 1
  317.100000 70.000000 1
  318.100000 57.000000 1
  319.100000 34.000000 1
  320.100000 119.000000 1
  322.100000 11.000000 1
  323.100000 18.000000 1
  325.100000 89.000000 1
  326.100000 11.000000 1
  327.100000 97.000000 1
  328.100000 74.000000 1
  329.100000 134.000000 1
  330.100000 121.000000 1
  331.100000 318.000000 1
  332.100000 58.000000 1
  333.100000 79.000000 1
  334.100000 19.000000 1
  337.100000 33.000000 1
  338.100000 39.000000 1
  339.100000 78.000000 1
  340.100000 41.000000 1
  341.100000 63.000000 1
  342.100000 34.000000 1
  343.100000 44.000000 1
  344.100000 86.000000 1
  346.100000 196.000000 1
  347.100000 26.000000 1
  348.100000 86.000000 1
  349.100000 18.000000 1
  350.100000 65.000000 1
  352.100000 39.000000 1
  354.100000 8.000000 1
  357.100000 13.000000 1
  360.100000 27.000000 1
  361.100000 22.000000 1
  365.100000 31.000000 1
  366.100000 36.000000 1
  367.100000 100.000000 1
  368.100000 19.000000 1
  370.100000 5.000000 1
  371.100000 52.000000 1
  372.100000 111.000000 1
  373.100000 81.000000 1
  374.100000 13.000000 1
  375.100000 5.000000 1
  377.100000 8.000000 1
  378.100000 38.000000 1
  379.100000 22.000000 1
  380.100000 33.000000 1
  381.100000 60.000000 1
  383.100000 100.000000 1
  384.100000 55.000000 1
  386.100000 52.000000 1
  387.100000 103.000000 1
  388.100000 87.000000 1
  389.100000 94.000000 1
  390.100000 46.000000 1
  391.100000 55.000000 1
  392.100000 31.000000 1
  393.100000 81.000000 1
  394.100000 41.000000 1
  395.100000 22.000000 1
  396.100000 55.000000 1
  397.100000 102.000000 1
  398.100000 92.000000 1
  399.100000 16.000000 1
  402.100000 13.000000 1
  403.100000 26.000000 1
  404.100000 68.000000 1
  405.100000 199.000000 1
  406.100000 38.000000 1
  407.100000 102.000000 1
  408.100000 66.000000 1
  409.100000 65.000000 1
  411.100000 82.000000 1
  412.100000 57.000000 1
  413.100000 54.000000 1
  414.100000 87.000000 1
  417.100000 74.000000 1
  418.100000 16.000000 1
  422.100000 11.000000 1
  424.100000 79.000000 1
  425.100000 94.000000 1
  427.100000 41.000000 1
  428.100000 27.000000 1
  430.100000 57.000000 1
  431.100000 55.000000 1
  432.100000 30.000000 1
  433.100000 100.000000 1
  434.100000 55.000000 1
  435.100000 41.000000 1
  436.100000 50.000000 1
  438.100000 98.000000 1
  439.100000 102.000000 1
  440.100000 66.000000 1
  443.100000 33.000000 1
  446.100000 82.000000 1
  447.100000 62.000000 1
  449.100000 29.000000 1
  450.100000 30.000000 1
  451.100000 19.000000 1
  452.100000 81.000000 1
  453.100000 79.000000 1
  457.100000 6.000000 1
  458.100000 14.000000 1
  459.100000 55.000000 1
  462.100000 124.000000 1
  464.100000 95.000000 1
  465.100000 66.000000 1
  467.100000 63.000000 1
  468.100000 24.000000 1
  469.100000 21.000000 1
  470.100000 62.000000 1
  471.100000 89.000000 1
  472.100000 31.000000 1
  473.100000 142.000000 1
  474.100000 94.000000 1
  475.100000 55.000000 1
  476.100000 18.000000 1
  477.100000 52.000000 1
  478.100000 18.000000 1
  479.100000 24.000000 1
  480.100000 76.000000 1
  481.100000 26.000000 1
  482.100000 89.000000 1
  483.100000 31.000000 1
  485.100000 33.000000 1
  486.100000 79.000000 1
  487.100000 50.000000 1
  488.100000 119.000000 1
  489.100000 68.000000 1
  491.100000 49.000000 1
  492.100000 52.000000 1
  493.100000 113.000000 1
  494.100000 79.000000 1
  495.100000 3.000000 1
  496.100000 36.000000 1
  497.100000 74.000000 1
  498.100000 16.000000 1
  499.100000 94.000000 1