ACCESSION: MSBNK-GL_Sciences_Inc-GLS00030
RECORD_TITLE: 2-Hydroxyphenylacetic acid; EI-B; MS; 2 TMS; RT: 622.62 s
DATE: 2016.01.19 (Created 2012.08.03, modified 2013.07.31)
AUTHORS: Miyagawa H, Akimoto S, Yamasaki K, GL Sciences Inc.
LICENSE: CC BY-SA
COPYRIGHT: GL Sciences Inc.
COMMENT: The chemical compound was chemically modified with N-methyl-N-trimethylsilyl-trifluoroacetamide(MSTFA) before GC-MS analysis. When it has two or more functional groups, this modification gave a mixture of the TMS derivatives having different number of TMS groups at different functional groups.

CH$NAME: 2-Hydroxyphenylacetic acid
CH$COMPOUND_CLASS: Natural Product
CH$FORMULA: C8H8O3
CH$EXACT_MASS: 152.04734
CH$SMILES: OC(=O)Cc(c1)c(O)ccc1
CH$IUPAC: InChI=1S/C8H8O3/c9-7-4-2-1-3-6(7)5-8(10)11/h1-4,9H,5H2,(H,10,11)
CH$LINK: CAS 614-75-5
CH$LINK: CHEBI 28478
CH$LINK: KEGG C05852
CH$LINK: PUBCHEM 8145
CH$LINK: INCHIKEY CCVYRRGZDBSHFU-UHFFFAOYSA-N
CH$LINK: COMPTOX DTXSID1060633

AC$INSTRUMENT: GCMS-2010 Plus, Shimadzu
AC$INSTRUMENT_TYPE: EI-B
AC$MASS_SPECTROMETRY: MS_TYPE MS
AC$MASS_SPECTROMETRY: ION_MODE POSITIVE
AC$MASS_SPECTROMETRY: GAS_PRESSURE 75 kPa
AC$MASS_SPECTROMETRY: ION_SOURCE_TEMPERATURE 200 C
AC$MASS_SPECTROMETRY: SCAN_RANGE_M/Z 85-500
AC$CHROMATOGRAPHY: COLUMN_NAME InertCap 5MS/NP 0.25 mmI.D. x 30 m, df=0.25 um
AC$CHROMATOGRAPHY: INJECTION_TEMPERATURE 230 C
AC$CHROMATOGRAPHY: OVEN_TEMPERATURE 80 C(2 min)-15 C/min - 330C
AC$CHROMATOGRAPHY: RETENTION_INDEX 1580
AC$CHROMATOGRAPHY: RETENTION_TIME 622.62
AC$CHROMATOGRAPHY: TRANSFARLINE_TEMPERATURE 250 C

MS$FOCUSED_ION: DERIVATIVE_TYPE 2 TMS
MS$DATA_PROCESSING: WHOLE GCMSsolution

PK$SPLASH: splash10-0002-0960000000-1018d2254ff44190f41a
PK$NUM_PEAK: 382
PK$PEAK: m/z int. rel.int.
  86.000000 553.000000 1
  87.050000 2101.000000 4
  88.050000 915.000000 2
  89.050000 12413.000000 25
  90.050000 7612.000000 16
  91.050000 21401.000000 44
  92.000000 1804.000000 4
  93.000000 1906.000000 4
  94.000000 337.000000 1
  95.100000 2140.000000 4
  96.050000 1165.000000 2
  97.050000 1215.000000 2
  98.000000 500.000000 1
  99.000000 519.000000 1
  100.000000 454.000000 1
  101.050000 1345.000000 3
  102.050000 2285.000000 5
  103.050000 11444.000000 23
  104.100000 5223.000000 11
  105.100000 33090.000000 67
  106.050000 10361.000000 21
  107.100000 2284.000000 5
  108.100000 370.000000 1
  109.050000 1365.000000 3
  110.000000 625.000000 1
  111.050000 2558.000000 5
  112.050000 805.000000 2
  113.100000 647.000000 1
  114.000000 167.000000 1
  115.050000 5059.000000 10
  116.100000 1852.000000 4
  117.050000 12850.000000 26
  118.100000 3889.000000 8
  119.050000 24537.000000 50
  120.050000 3480.000000 7
  121.000000 7783.000000 16
  122.000000 1265.000000 3
  123.050000 2616.000000 5
  124.000000 274.000000 1
  125.000000 335.000000 1
  126.000000 92.000000 1
  127.000000 300.000000 1
  128.000000 503.000000 1
  129.000000 774.000000 2
  130.100000 518.000000 1
  131.050000 15172.000000 31
  132.150000 2569.000000 5
  133.050000 47595.000000 97
  134.050000 28079.000000 57
  135.050000 30674.000000 62
  136.050000 4270.000000 9
  137.050000 5461.000000 11
  138.100000 719.000000 1
  139.100000 409.000000 1
  140.100000 303.000000 1
  141.100000 324.000000 1
  142.100000 95.000000 1
  143.100000 746.000000 2
  144.100000 250.000000 1
  145.100000 2402.000000 5
  146.150000 1816.000000 4
  147.100000 490350.000000 999
  148.100000 79838.000000 163
  149.100000 196686.000000 401
  150.100000 25428.000000 52
  151.100000 16388.000000 33
  152.100000 2154.000000 4
  153.100000 662.000000 1
  154.100000 236.000000 1
  155.100000 38.000000 1
  156.100000 806.000000 2
  157.100000 390.000000 1
  158.100000 321.000000 1
  159.100000 1025.000000 2
  160.100000 468.000000 1
  161.050000 16446.000000 34
  162.100000 3388.000000 7
  163.100000 32521.000000 66
  164.100000 172305.000000 351
  165.050000 29495.000000 60
  166.050000 7985.000000 16
  167.050000 1332.000000 3
  168.100000 289.000000 1
  169.100000 65.000000 1
  170.100000 143.000000 1
  171.100000 78.000000 1
  172.100000 30.000000 1
  173.100000 233.000000 1
  174.100000 212.000000 1
  175.100000 862.000000 2
  176.150000 987.000000 2
  177.050000 21449.000000 44
  178.100000 4420.000000 9
  179.050000 30553.000000 62
  180.050000 5135.000000 10
  181.000000 3934.000000 8
  182.000000 617.000000 1
  183.000000 342.000000 1
  184.000000 172.000000 1
  186.000000 21.000000 1
  187.000000 46.000000 1
  188.000000 113.000000 1
  189.000000 303.000000 1
  190.000000 145.000000 1
  191.000000 734.000000 1
  192.000000 298.000000 1
  193.000000 2554.000000 5
  194.000000 535.000000 1
  195.000000 5276.000000 11
  196.000000 980.000000 2
  197.000000 527.000000 1
  198.000000 177.000000 1
  199.000000 87.000000 1
  200.000000 113.000000 1
  201.000000 73.000000 1
  203.000000 212.000000 1
  204.000000 105.000000 1
  205.000000 585.000000 1
  206.050000 9738.000000 20
  207.050000 5757.000000 12
  208.050000 2457.000000 5
  209.000000 41540.000000 85
  210.000000 9002.000000 18
  211.000000 3892.000000 8
  212.000000 681.000000 1
  213.000000 166.000000 1
  214.000000 42.000000 1
  215.000000 118.000000 1
  216.000000 31.000000 1
  217.000000 191.000000 1
  218.000000 172.000000 1
  219.000000 1439.000000 3
  220.000000 268.000000 1
  221.050000 2339.000000 5
  222.050000 766.000000 2
  223.000000 3514.000000 7
  224.050000 1002.000000 2
  225.050000 21715.000000 44
  226.000000 4334.000000 9
  227.100000 1572.000000 3
  228.100000 380.000000 1
  229.100000 111.000000 1
  230.100000 44.000000 1
  231.100000 111.000000 1
  232.100000 153.000000 1
  233.100000 874.000000 2
  234.000000 241.000000 1
  235.050000 12437.000000 25
  236.150000 3031.000000 6
  237.050000 68568.000000 140
  238.050000 15725.000000 32
  239.050000 6927.000000 14
  240.100000 1105.000000 2
  241.100000 130.000000 1
  242.100000 183.000000 1
  243.100000 14.000000 1
  244.100000 84.000000 1
  245.100000 52.000000 1
  246.100000 92.000000 1
  247.100000 252.000000 1
  248.100000 113.000000 1
  249.100000 441.000000 1
  250.100000 127.000000 1
  251.100000 1022.000000 2
  252.150000 6365.000000 13
  253.100000 293116.000000 597
  254.050000 65714.000000 134
  255.100000 26100.000000 53
  256.050000 4007.000000 8
  257.100000 817.000000 2
  258.100000 226.000000 1
  259.100000 124.000000 1
  260.100000 18.000000 1
  261.100000 105.000000 1
  263.100000 71.000000 1
  264.100000 154.000000 1
  265.100000 513.000000 1
  266.100000 150.000000 1
  267.200000 1252.000000 3
  268.200000 327.000000 1
  269.200000 71.000000 1
  270.200000 19.000000 1
  271.200000 110.000000 1
  272.200000 66.000000 1
  273.200000 78.000000 1
  274.200000 90.000000 1
  276.200000 103.000000 1
  277.200000 106.000000 1
  279.200000 263.000000 1
  280.150000 2161.000000 4
  281.050000 134432.000000 274
  282.050000 33317.000000 68
  283.050000 12656.000000 26
  284.000000 1985.000000 4
  285.000000 297.000000 1
  286.000000 130.000000 1
  287.000000 138.000000 1
  288.000000 103.000000 1
  289.000000 110.000000 1
  290.000000 114.000000 1
  291.000000 14.000000 1
  292.000000 41.000000 1
  293.000000 174.000000 1
  294.000000 46.000000 1
  295.150000 1612.000000 3
  296.100000 170857.000000 348
  297.100000 45170.000000 92
  298.100000 17358.000000 35
  299.050000 3098.000000 6
  300.100000 511.000000 1
  301.100000 124.000000 1
  302.100000 36.000000 1
  303.100000 182.000000 1
  304.100000 92.000000 1
  306.100000 55.000000 1
  307.100000 164.000000 1
  308.100000 66.000000 1
  309.100000 55.000000 1
  310.100000 82.000000 1
  311.100000 63.000000 1
  312.100000 71.000000 1
  313.100000 116.000000 1
  314.100000 50.000000 1
  315.100000 102.000000 1
  316.100000 50.000000 1
  318.100000 31.000000 1
  319.100000 50.000000 1
  320.100000 106.000000 1
  321.100000 70.000000 1
  322.100000 55.000000 1
  323.100000 110.000000 1
  324.100000 122.000000 1
  325.100000 68.000000 1
  326.100000 65.000000 1
  327.100000 175.000000 1
  328.100000 86.000000 1
  329.100000 97.000000 1
  330.100000 81.000000 1
  331.100000 199.000000 1
  332.100000 58.000000 1
  333.100000 34.000000 1
  335.100000 116.000000 1
  336.100000 44.000000 1
  337.100000 95.000000 1
  338.100000 11.000000 1
  339.100000 26.000000 1
  341.100000 105.000000 1
  342.100000 111.000000 1
  343.100000 182.000000 1
  344.100000 46.000000 1
  346.100000 38.000000 1
  347.100000 29.000000 1
  348.100000 76.000000 1
  351.100000 42.000000 1
  352.100000 106.000000 1
  353.100000 84.000000 1
  354.100000 26.000000 1
  355.100000 151.000000 1
  356.100000 42.000000 1
  357.100000 6.000000 1
  358.100000 95.000000 1
  359.100000 39.000000 1
  360.100000 76.000000 1
  361.100000 21.000000 1
  362.100000 36.000000 1
  364.100000 52.000000 1
  365.100000 52.000000 1
  366.100000 34.000000 1
  367.100000 22.000000 1
  368.100000 24.000000 1
  369.100000 450.000000 1
  370.100000 286.000000 1
  371.100000 186.000000 1
  373.100000 70.000000 1
  374.100000 119.000000 1
  376.100000 54.000000 1
  377.100000 100.000000 1
  378.100000 52.000000 1
  379.100000 5.000000 1
  380.100000 52.000000 1
  381.100000 62.000000 1
  382.100000 84.000000 1
  383.100000 21.000000 1
  385.100000 98.000000 1
  386.100000 55.000000 1
  387.100000 26.000000 1
  388.100000 74.000000 1
  389.100000 30.000000 1
  390.100000 27.000000 1
  391.100000 71.000000 1
  392.100000 103.000000 1
  393.100000 82.000000 1
  394.100000 122.000000 1
  395.100000 31.000000 1
  396.100000 16.000000 1
  397.100000 38.000000 1
  398.100000 94.000000 1
  399.100000 58.000000 1
  400.100000 11.000000 1
  401.100000 50.000000 1
  402.100000 52.000000 1
  403.100000 199.000000 1
  404.100000 188.000000 1
  405.100000 143.000000 1
  406.100000 156.000000 1
  407.100000 142.000000 1
  408.100000 22.000000 1
  409.100000 38.000000 1
  410.100000 49.000000 1
  411.100000 50.000000 1
  412.100000 47.000000 1
  413.100000 57.000000 1
  414.100000 11.000000 1
  415.100000 95.000000 1
  416.100000 8.000000 1
  417.100000 49.000000 1
  418.100000 19.000000 1
  419.100000 81.000000 1
  420.100000 33.000000 1
  421.100000 36.000000 1
  422.100000 39.000000 1
  423.100000 29.000000 1
  424.100000 2.000000 1
  425.100000 46.000000 1
  427.100000 100.000000 1
  428.100000 14.000000 1
  429.100000 5.000000 1
  430.100000 47.000000 1
  431.100000 90.000000 1
  432.100000 87.000000 1
  433.100000 54.000000 1
  435.100000 36.000000 1
  436.100000 65.000000 1
  437.100000 58.000000 1
  439.100000 57.000000 1
  440.100000 74.000000 1
  441.100000 50.000000 1
  442.100000 92.000000 1
  443.100000 158.000000 1
  444.100000 182.000000 1
  445.100000 55.000000 1
  446.100000 118.000000 1
  450.100000 57.000000 1
  451.100000 103.000000 1
  452.100000 66.000000 1
  453.100000 122.000000 1
  454.100000 44.000000 1
  455.100000 5.000000 1
  456.100000 47.000000 1
  458.100000 14.000000 1
  459.100000 49.000000 1
  460.100000 78.000000 1
  461.100000 84.000000 1
  462.100000 21.000000 1
  463.100000 39.000000 1
  464.100000 95.000000 1
  466.100000 27.000000 1
  467.100000 38.000000 1
  470.100000 60.000000 1
  471.100000 26.000000 1
  472.100000 21.000000 1
  473.100000 57.000000 1
  474.100000 100.000000 1
  475.100000 102.000000 1
  477.100000 11.000000 1
  478.100000 30.000000 1
  479.100000 73.000000 1
  481.100000 38.000000 1
  482.100000 18.000000 1
  484.100000 10.000000 1
  485.100000 108.000000 1
  486.100000 14.000000 1
  487.100000 138.000000 1
  489.100000 14.000000 1
  490.100000 116.000000 1
  491.100000 118.000000 1
  492.100000 52.000000 1
  494.100000 31.000000 1
  495.100000 68.000000 1
  496.100000 19.000000 1
  497.100000 84.000000 1
  499.100000 79.000000 1