ACCESSION: MSBNK-GL_Sciences_Inc-GLS00020
RECORD_TITLE: 4-Hydroxyphenylacetic acid; EI-B; MS; 2 TMS; RT: 657.00 s
DATE: 2016.01.19 (Created 2012.08.03, modified 2013.07.31)
AUTHORS: Miyagawa H, Akimoto S, Yamasaki K, GL Sciences Inc.
LICENSE: CC BY-SA
COPYRIGHT: GL Sciences Inc.
COMMENT: The chemical compound was chemically modified with N-methyl-N-trimethylsilyl-trifluoroacetamide(MSTFA) before GC-MS analysis. When it has two or more functional groups, this modification gave a mixture of the TMS derivatives having different number of TMS groups at different functional groups.

CH$NAME: 4-Hydroxyphenylacetic acid
CH$COMPOUND_CLASS: Natural Product
CH$FORMULA: C8H8O3
CH$EXACT_MASS: 152.04734
CH$SMILES: OC(=O)Cc(c1)ccc(O)c1
CH$IUPAC: InChI=1S/C8H8O3/c9-7-3-1-6(2-4-7)5-8(10)11/h1-4,9H,5H2,(H,10,11)
CH$LINK: CAS 156-38-7
CH$LINK: CHEBI 18101
CH$LINK: KEGG C00642
CH$LINK: PUBCHEM 3915
CH$LINK: INCHIKEY XQXPVVBIMDBYFF-UHFFFAOYSA-N
CH$LINK: COMPTOX DTXSID5059745

AC$INSTRUMENT: GCMS-2010 Plus, Shimadzu
AC$INSTRUMENT_TYPE: EI-B
AC$MASS_SPECTROMETRY: MS_TYPE MS
AC$MASS_SPECTROMETRY: ION_MODE POSITIVE
AC$MASS_SPECTROMETRY: GAS_PRESSURE 75 kPa
AC$MASS_SPECTROMETRY: ION_SOURCE_TEMPERATURE 200 C
AC$MASS_SPECTROMETRY: SCAN_RANGE_M/Z 85-500
AC$CHROMATOGRAPHY: COLUMN_NAME InertCap 5MS/NP 0.25 mmI.D. x 30 m, df=0.25 um
AC$CHROMATOGRAPHY: INJECTION_TEMPERATURE 230 C
AC$CHROMATOGRAPHY: OVEN_TEMPERATURE 80 C(2 min)-15 C/min - 330C
AC$CHROMATOGRAPHY: RETENTION_INDEX 1648
AC$CHROMATOGRAPHY: RETENTION_TIME 657.00
AC$CHROMATOGRAPHY: TRANSFARLINE_TEMPERATURE 250 C

MS$FOCUSED_ION: DERIVATIVE_TYPE 2 TMS
MS$DATA_PROCESSING: WHOLE GCMSsolution

PK$SPLASH: splash10-0gyk-0980000000-ed36f36969e4d51b9a8d
PK$NUM_PEAK: 385
PK$PEAK: m/z int. rel.int.
  86.050000 1119.000000 2
  87.050000 4371.000000 9
  88.150000 2002.000000 4
  89.050000 37443.000000 75
  90.050000 29963.000000 60
  91.050000 16909.000000 34
  92.000000 1594.000000 3
  93.050000 2708.000000 5
  94.000000 439.000000 1
  95.050000 3595.000000 7
  96.100000 838.000000 2
  97.050000 1234.000000 2
  98.150000 760.000000 2
  99.050000 2393.000000 5
  100.100000 1734.000000 3
  101.100000 1804.000000 4
  102.050000 2533.000000 5
  103.100000 14682.000000 29
  104.100000 12844.000000 26
  105.100000 24607.000000 49
  106.100000 3148.000000 6
  107.050000 6202.000000 12
  108.100000 703.000000 1
  109.050000 2220.000000 4
  110.100000 706.000000 1
  111.100000 814.000000 2
  112.150000 696.000000 1
  113.050000 7968.000000 16
  114.100000 1114.000000 2
  115.100000 4910.000000 10
  116.150000 1701.000000 3
  117.050000 37925.000000 76
  118.100000 7641.000000 15
  119.050000 9268.000000 18
  120.050000 1506.000000 3
  121.100000 5924.000000 12
  122.000000 906.000000 2
  123.050000 2225.000000 4
  124.000000 468.000000 1
  125.150000 1296.000000 3
  126.200000 876.000000 2
  127.200000 550.000000 1
  128.200000 367.000000 1
  129.100000 1031.000000 2
  130.100000 642.000000 1
  131.100000 10772.000000 21
  132.150000 2881.000000 6
  133.100000 86225.000000 172
  134.050000 14933.000000 30
  135.050000 24175.000000 48
  136.100000 2996.000000 6
  137.100000 5025.000000 10
  138.100000 761.000000 2
  139.100000 484.000000 1
  140.300000 825.000000 2
  141.300000 334.000000 1
  142.100000 185.000000 1
  143.100000 1718.000000 3
  144.100000 478.000000 1
  145.100000 7057.000000 14
  146.150000 2377.000000 5
  147.100000 126158.000000 251
  148.100000 23343.000000 47
  149.100000 99857.000000 199
  150.100000 13718.000000 27
  151.100000 6546.000000 13
  152.100000 607.000000 1
  153.100000 665.000000 1
  154.100000 201.000000 1
  155.100000 286.000000 1
  156.100000 156.000000 1
  157.100000 402.000000 1
  158.100000 161.000000 1
  159.100000 1865.000000 4
  160.100000 505.000000 1
  161.050000 14845.000000 30
  162.150000 5187.000000 10
  163.100000 66092.000000 132
  164.100000 341108.000000 680
  165.100000 56082.000000 112
  166.100000 14958.000000 30
  167.100000 1980.000000 4
  168.100000 343.000000 1
  169.100000 182.000000 1
  170.100000 33.000000 1
  171.100000 671.000000 1
  172.100000 452.000000 1
  173.100000 366.000000 1
  174.100000 740.000000 1
  175.050000 1688.000000 3
  176.150000 1996.000000 4
  177.100000 41146.000000 82
  178.150000 15439.000000 31
  179.100000 501386.000000 999
  180.100000 82151.000000 164
  181.100000 23314.000000 46
  182.100000 3135.000000 6
  183.100000 372.000000 1
  184.100000 353.000000 1
  185.100000 156.000000 1
  186.100000 111.000000 1
  187.100000 182.000000 1
  188.100000 1292.000000 3
  189.100000 785.000000 2
  190.050000 834.000000 2
  191.000000 17594.000000 35
  192.050000 2705.000000 5
  193.050000 12026.000000 24
  194.050000 2231.000000 4
  195.050000 3371.000000 7
  196.000000 681.000000 1
  197.000000 409.000000 1
  198.000000 143.000000 1
  199.000000 177.000000 1
  200.000000 164.000000 1
  201.000000 41.000000 1
  202.000000 52.000000 1
  203.000000 161.000000 1
  204.000000 335.000000 1
  205.150000 941.000000 2
  206.050000 9600.000000 19
  207.050000 4703.000000 9
  208.050000 3440.000000 7
  209.050000 14819.000000 30
  210.050000 2875.000000 6
  211.100000 6601.000000 13
  212.100000 1070.000000 2
  213.100000 436.000000 1
  214.100000 114.000000 1
  215.100000 81.000000 1
  217.100000 244.000000 1
  218.000000 70.000000 1
  219.000000 1801.000000 4
  220.000000 385.000000 1
  221.050000 5022.000000 10
  222.100000 1606.000000 3
  223.100000 3564.000000 7
  224.150000 1293.000000 3
  225.050000 28096.000000 56
  226.100000 5898.000000 12
  227.050000 2576.000000 5
  228.100000 698.000000 1
  229.100000 196.000000 1
  230.100000 26.000000 1
  231.100000 124.000000 1
  232.100000 89.000000 1
  233.100000 674.000000 1
  234.100000 644.000000 1
  235.100000 3201.000000 6
  236.150000 3794.000000 8
  237.100000 26122.000000 52
  238.100000 7116.000000 14
  239.100000 8558.000000 17
  240.050000 1653.000000 3
  241.000000 420.000000 1
  242.000000 119.000000 1
  243.000000 44.000000 1
  244.000000 60.000000 1
  245.000000 33.000000 1
  246.000000 29.000000 1
  247.000000 422.000000 1
  248.000000 121.000000 1
  249.050000 1776.000000 4
  250.000000 490.000000 1
  251.150000 5532.000000 11
  252.150000 464418.000000 925
  253.100000 150546.000000 300
  254.150000 54135.000000 108
  255.100000 10180.000000 20
  256.100000 2622.000000 5
  257.100000 578.000000 1
  258.100000 302.000000 1
  259.100000 41.000000 1
  260.100000 156.000000 1
  261.100000 34.000000 1
  262.100000 86.000000 1
  263.100000 217.000000 1
  264.100000 207.000000 1
  265.100000 11847.000000 24
  266.100000 2777.000000 6
  267.100000 3316.000000 7
  268.100000 545.000000 1
  269.100000 375.000000 1
  270.100000 119.000000 1
  271.100000 167.000000 1
  272.100000 46.000000 1
  273.100000 49.000000 1
  275.100000 129.000000 1
  276.100000 95.000000 1
  277.100000 11.000000 1
  278.100000 98.000000 1
  279.050000 1153.000000 2
  280.150000 3322.000000 7
  281.100000 263500.000000 525
  282.100000 64927.000000 129
  283.100000 27497.000000 55
  284.150000 4693.000000 9
  285.100000 569.000000 1
  286.100000 118.000000 1
  287.100000 102.000000 1
  288.100000 29.000000 1
  289.100000 90.000000 1
  290.100000 62.000000 1
  292.100000 100.000000 1
  293.100000 169.000000 1
  294.100000 228.000000 1
  295.150000 3289.000000 7
  296.150000 311413.000000 620
  297.100000 82817.000000 165
  298.150000 33021.000000 66
  299.100000 6038.000000 12
  300.100000 1046.000000 2
  301.100000 143.000000 1
  302.100000 41.000000 1
  303.100000 111.000000 1
  304.100000 66.000000 1
  305.100000 63.000000 1
  307.100000 204.000000 1
  308.100000 79.000000 1
  309.100000 175.000000 1
  310.100000 63.000000 1
  311.100000 122.000000 1
  312.100000 52.000000 1
  313.100000 78.000000 1
  314.100000 63.000000 1
  315.100000 13.000000 1
  316.100000 54.000000 1
  317.100000 47.000000 1
  318.100000 57.000000 1
  320.100000 13.000000 1
  321.100000 78.000000 1
  324.100000 24.000000 1
  325.100000 66.000000 1
  326.100000 127.000000 1
  327.100000 126.000000 1
  328.100000 79.000000 1
  329.100000 63.000000 1
  331.100000 63.000000 1
  332.100000 49.000000 1
  333.100000 110.000000 1
  334.100000 103.000000 1
  335.100000 55.000000 1
  336.100000 41.000000 1
  337.100000 49.000000 1
  339.100000 30.000000 1
  340.100000 41.000000 1
  341.100000 95.000000 1
  342.100000 39.000000 1
  343.100000 76.000000 1
  344.100000 34.000000 1
  345.100000 49.000000 1
  346.100000 124.000000 1
  347.100000 70.000000 1
  348.100000 54.000000 1
  349.100000 29.000000 1
  350.100000 27.000000 1
  351.100000 63.000000 1
  352.100000 102.000000 1
  353.100000 82.000000 1
  354.100000 36.000000 1
  355.100000 158.000000 1
  356.100000 65.000000 1
  357.100000 57.000000 1
  358.100000 111.000000 1
  359.100000 5.000000 1
  360.100000 24.000000 1
  361.100000 130.000000 1
  362.100000 19.000000 1
  363.100000 58.000000 1
  364.100000 94.000000 1
  365.100000 60.000000 1
  366.100000 31.000000 1
  367.100000 68.000000 1
  368.100000 68.000000 1
  369.100000 1014.000000 2
  370.100000 308.000000 1
  371.100000 108.000000 1
  372.100000 22.000000 1
  373.100000 29.000000 1
  374.100000 26.000000 1
  375.100000 3.000000 1
  376.100000 119.000000 1
  377.100000 55.000000 1
  378.100000 60.000000 1
  379.100000 2.000000 1
  380.100000 50.000000 1
  382.100000 44.000000 1
  383.100000 63.000000 1
  384.100000 38.000000 1
  385.100000 46.000000 1
  386.100000 81.000000 1
  387.100000 30.000000 1
  388.100000 113.000000 1
  389.100000 63.000000 1
  390.100000 58.000000 1
  391.100000 84.000000 1
  392.100000 78.000000 1
  395.100000 42.000000 1
  396.100000 8.000000 1
  397.100000 42.000000 1
  398.100000 46.000000 1
  399.100000 63.000000 1
  400.100000 84.000000 1
  401.100000 55.000000 1
  402.100000 119.000000 1
  403.100000 24.000000 1
  404.100000 46.000000 1
  405.100000 172.000000 1
  406.100000 92.000000 1
  408.100000 16.000000 1
  409.100000 95.000000 1
  410.100000 42.000000 1
  411.100000 58.000000 1
  412.100000 33.000000 1
  413.100000 113.000000 1
  414.100000 92.000000 1
  416.100000 78.000000 1
  417.100000 21.000000 1
  419.100000 62.000000 1
  420.100000 46.000000 1
  421.100000 36.000000 1
  422.100000 36.000000 1
  424.100000 137.000000 1
  425.100000 41.000000 1
  426.100000 30.000000 1
  427.100000 30.000000 1
  428.100000 81.000000 1
  430.100000 3.000000 1
  431.100000 60.000000 1
  433.100000 44.000000 1
  435.100000 54.000000 1
  436.100000 138.000000 1
  438.100000 10.000000 1
  439.100000 103.000000 1
  440.100000 114.000000 1
  441.100000 13.000000 1
  442.100000 142.000000 1
  443.100000 177.000000 1
  444.100000 188.000000 1
  445.100000 105.000000 1
  446.100000 143.000000 1
  447.100000 8.000000 1
  448.100000 74.000000 1
  449.100000 2.000000 1
  450.100000 55.000000 1
  452.100000 27.000000 1
  453.100000 60.000000 1
  454.100000 22.000000 1
  455.100000 130.000000 1
  456.100000 111.000000 1
  457.100000 29.000000 1
  458.100000 8.000000 1
  459.100000 66.000000 1
  460.100000 154.000000 1
  461.100000 110.000000 1
  462.100000 90.000000 1
  463.100000 6.000000 1
  464.100000 14.000000 1
  465.100000 86.000000 1
  466.100000 14.000000 1
  467.100000 97.000000 1
  468.100000 13.000000 1
  469.100000 70.000000 1
  470.100000 108.000000 1
  471.100000 16.000000 1
  472.100000 47.000000 1
  474.100000 33.000000 1
  476.100000 39.000000 1
  477.100000 8.000000 1
  478.100000 86.000000 1
  479.100000 78.000000 1
  480.100000 47.000000 1
  481.100000 33.000000 1
  483.100000 26.000000 1
  484.100000 78.000000 1
  485.100000 92.000000 1
  487.100000 65.000000 1
  488.100000 41.000000 1
  489.100000 70.000000 1
  490.100000 81.000000 1
  492.100000 71.000000 1
  493.100000 66.000000 1
  494.100000 31.000000 1
  495.100000 41.000000 1
  496.100000 33.000000 1