ACCESSION: MSBNK-Fiocruz-FIO00693
RECORD_TITLE: Beauvericin; LC-ESI-QTOF; MS2; [M+H]+; CE: 10eV
DATE: 2016.01.19 (Created 2014.10.02)
AUTHORS: Markus Kohlhoff, Natural Product Chemistry Lab (CPqRR/FIOCRUZ, Brazil)
LICENSE: CC BY-NC
COPYRIGHT: (c) Research Center Rene Rachou (FIOCRUZ, Brazil)
COMMENT: [Raw Data] CBA19_Beauvericin_pos_10eV_1-1_01_1352.txt

CH$NAME: Beauvericin
CH$COMPOUND_CLASS: Natural Product; Peptide derivatives
CH$FORMULA: C45H57N3O9
CH$EXACT_MASS: 783.40948
CH$SMILES: O(C(C(C)C)4)C(C(N(C)C(=O)C(OC(C(N(C)C(=O)C(OC(C(N(C)C(=O)4)Cc(c3)cccc3)=O)C(C)C)Cc(c2)cccc2)=O)C(C)C)Cc(c1)cccc1)=O
CH$IUPAC: InChI=1S/C45H57N3O9/c1-28(2)37-40(49)46(7)35(26-32-21-15-11-16-22-32)44(53)56-39(30(5)6)42(51)48(9)36(27-33-23-17-12-18-24-33)45(54)57-38(29(3)4)41(50)47(8)34(43(52)55-37)25-31-19-13-10-14-20-31/h10-24,28-30,34-39H,25-27H2,1-9H3
CH$LINK: CAS 26048-05-5
CH$LINK: CHEBI 3000
CH$LINK: CHEMSPIDER 2277520
CH$LINK: KEGG C11590
CH$LINK: KNAPSACK C00027924
CH$LINK: NIKKAJI J21.174E
CH$LINK: PUBCHEM 13755
CH$LINK: INCHIKEY GYSCAQFHASJXRS-UHFFFAOYSA-N

AC$INSTRUMENT: maXis (Bruker Daltonics)
AC$INSTRUMENT_TYPE: LC-ESI-QTOF
AC$MASS_SPECTROMETRY: MS_TYPE MS2
AC$MASS_SPECTROMETRY: ION_MODE POSITIVE
AC$MASS_SPECTROMETRY: CAPILLARY_VOLTAGE 4500 V
AC$MASS_SPECTROMETRY: COLLISION_ENERGY 10 eV
AC$MASS_SPECTROMETRY: COLLISION_GAS Nitrogen
AC$MASS_SPECTROMETRY: DESOLVATION_GAS_FLOW 8 l/min
AC$MASS_SPECTROMETRY: DESOLVATION_TEMPERATURE 200 C
AC$MASS_SPECTROMETRY: FRAGMENTATION_MODE CID
AC$MASS_SPECTROMETRY: IONIZATION ESI
AC$MASS_SPECTROMETRY: NEBULIZER 2.0 bar
AC$CHROMATOGRAPHY: COLUMN_NAME Supelco Titan C18 1.9um
AC$CHROMATOGRAPHY: COLUMN_TEMPERATURE 40 C
AC$CHROMATOGRAPHY: FLOW_GRADIENT 5-100%B in 12min
AC$CHROMATOGRAPHY: FLOW_RATE 200ul/min
AC$CHROMATOGRAPHY: SOLVENT A water with 0.1% formic acid
AC$CHROMATOGRAPHY: SOLVENT B acetonitrile with 0.1% formic acid

MS$FOCUSED_ION: PRECURSOR_TYPE [M+H]+
MS$DATA_PROCESSING: FIND_PEAK local
MS$DATA_PROCESSING: WHOLE Mass++ 2.7.2

PK$SPLASH: splash10-001r-0000000900-ec3217f98ff1e1369f7a
PK$NUM_PEAK: 7
PK$PEAK: m/z int. rel.int.
  244.133000 2733.000000 15
  784.415600 179304.000000 999
  785.418700 85095.000000 474
  786.421500 24507.000000 137
  787.424500 4429.000000 25
  802.426000 11358.000000 63
  803.429400 5306.000000 30